program: Gaussian 09
title: 000132485
version: EM64L-G09RevD.01
frameworkgroup: C1[X(C13H18N5O7P)]
method: RPBEPBE
basis: SDD
operation: Freq
keyword: #p
keyword: freq=noraman
keyword: PBEPBE/SDD
title: #p freq=noraman PBEPBE/SDD
converged: YES YES NO NO
title: Mulliken charges:
elementType: P O O O O O O O N N N N N C C C C C C C C C C C C C H H H H H H H H H H H H H H H H H H
charge: 1.400983 -0.295296 -0.432826 -0.421964 -0.524063 -0.481062 -0.484183 -0.583645 -0.197579 -0.081003 -0.186341 -0.060383 -0.603345 -0.149836 -0.165273 -0.043122 -0.053315 -0.294064 0.235713 -0.195053 -0.098643 -0.388063 -0.298498 -0.329092 0.173340 -0.330319 0.260837 0.206549 0.238228 0.265313 0.250058 0.229481 0.341213 0.392936 0.294776 0.245170 0.214823 0.234386 0.240662 0.239000 0.289243 0.254047 0.350673 0.339538
chargesum: 0.00000
title: Mulliken charges with hydrogens summed into heavy atoms:
elementType: P O O O O O O O N N N N N C C C C C C C C C C C C C
charge: 1.400983 -0.295296 -0.091613 -0.029028 -0.524063 -0.481062 -0.484183 -0.583645 -0.197579 -0.081003 -0.186341 -0.060383 0.086865 0.111002 0.041276 0.195106 0.211998 0.185475 0.235713 0.099723 -0.098643 0.071930 0.176550 0.199150 0.173340 -0.076273
polarizability: 3.03983038e+02 5.66352589e-02 2.16162783e+02 5.80512144e+00 -4.32365644e+00 1.42156388e+02
1716.lowfreq: -5.6227 -0.0011 -0.0003 0.0004 4.6698 5.0782 12.0456 21.6075 31.5164
frequency: 7.4010 21.2198 31.4937 42.0902 62.3835 75.4478 80.1478 99.5370 102.8362 117.6926 143.8940 160.3953 168.3719 181.2241 202.8587 214.3003 242.3494 243.4560 256.4308 272.0840 282.4669 294.0156 307.9574 322.0327 331.1134 356.6707 385.2174 395.9749 399.7969 432.9510 476.7567 514.8387 519.9623 533.9933 537.6406 544.5070 556.0404 559.1431 566.8538 588.0021 605.0765 625.7536 643.2486 663.4997 680.8525 698.5483 713.8138 791.7715 794.9098 811.8142 843.0715 850.4402 866.0423 876.7068 883.5450 904.4840 906.4585 913.3452 931.1880 961.1735 962.1157 978.5401 989.8288 1005.4951 1031.5458 1041.1932 1052.2538 1056.1884 1083.9510 1090.4255 1096.0694 1118.5293 1134.8216 1145.5664 1181.5836 1184.3448 1187.9855 1197.6536 1215.7252 1225.6266 1229.2956 1247.9406 1262.4576 1269.9749 1277.2040 1291.2889 1306.3446 1328.5731 1341.7243 1345.4338 1348.5434 1351.8457 1356.3909 1373.2027 1376.5765 1378.7319 1384.1370 1396.5463 1431.8778 1433.6614 1460.9438 1473.9042 1475.7959 1478.6306 1484.9572 1540.6508 1582.0251 1638.1111 2888.0337 2933.7459 2986.3769 2997.3034 3000.9349 3010.8397 3013.3497 3014.5729 3065.6628 3068.3704 3079.3664 3105.5070 3110.1766 3173.5071 3262.0086 3535.5624 3550.1580 3689.3907
redmass: 7.4085 5.7296 6.6921 5.9650 5.9357 5.9171 6.4246 4.2640 5.9810 3.9230 2.5787 2.7765 3.4366 3.1510 3.8491 4.7736 4.9634 7.3874 5.3154 6.6921 3.8829 7.0314 4.7293 3.3881 3.3175 6.2205 7.7260 5.2038 6.3302 4.5063 4.0931 4.7651 7.7074 2.3964 2.6208 1.4418 2.2810 1.2524 4.3744 7.3768 7.2749 7.9810 4.6556 9.2830 9.9619 10.2668 7.5931 7.7322 5.6645 3.3710 1.4625 4.9786 4.5084 1.5400 1.4971 1.3596 5.0213 3.0538 1.4264 8.0855 2.5490 6.4317 4.4803 3.4935 5.8713 3.1106 4.0495 2.1028 5.0057 4.3740 3.6432 1.8297 2.6102 4.1407 1.5945 1.2632 1.1265 1.3804 1.3006 2.3886 1.2645 1.4296 1.1810 1.6058 1.5324 3.2871 1.9273 2.7958 1.5445 1.2731 1.3154 1.3529 1.3596 1.9080 1.4853 1.2270 6.5290 1.1811 1.0900 3.1037 1.0819 3.9182 1.0859 1.0860 1.3167 8.4097 1.8170 2.8344 1.0811 1.0702 1.0850 1.0641 1.0607 1.0808 1.0646 1.0628 1.0871 1.0986 1.1058 1.1053 1.1063 1.0927 1.0991 1.0445 1.0661 1.1056
irintensity: 1.5318 2.8067 1.3560 0.6979 5.1289 0.6958 2.4770 3.0634 0.9687 15.7018 34.0630 23.0687 12.6697 24.7267 9.0444 16.8850 13.1850 0.8860 2.7145 26.6605 14.0284 5.5754 21.2501 1.7686 5.8122 18.4133 55.6286 5.0102 10.0778 1.5257 36.9280 1.8161 10.4042 10.4991 31.8284 180.0634 21.3802 20.9847 5.6723 6.4304 9.4294 22.5085 39.6732 18.9633 110.2194 130.0428 92.6080 5.0062 13.9632 67.2660 18.9278 27.6009 21.3096 70.1991 49.7170 0.0916 17.9159 79.8568 5.7431 79.5666 19.9328 427.7947 63.9610 131.1470 21.2358 14.5826 15.4783 0.2957 125.3554 66.6156 77.5660 5.0345 1.5752 24.0288 44.3966 32.1623 0.1821 21.0020 8.3142 53.4336 5.3968 15.7019 1.0470 63.6743 67.7993 37.1456 15.5608 8.9780 49.2250 7.3030 41.8016 21.5428 3.4608 37.6929 6.8005 8.3257 18.0864 14.8571 19.0479 51.2124 6.2219 29.9675 5.5826 11.7720 152.5804 43.9566 32.5396 662.4952 125.8910 985.4830 23.0439 11.8949 16.3757 35.2016 22.3490 20.4807 11.1632 19.1947 19.9484 16.7086 13.7585 9.2577 4.7186 152.6125 10.6017 54.8404
temp: 298.150 k
press: 1.00000 atm
elementType: 15 8 8 8 8 8 8 8 7 7 7 7 7 6 6 6 6 6 6 6 6 6 6 6 6 6 1 1 1 1 1 1 1 1 1 1 1 1 1 1 1 1 1 1
symmnumber: 1
zpe: 866864.2 jmol-1
zpe.correction: 0.330171 hartree
zpe.thermalcorrener: 0.354661 hartree
zpe.thermalcorrenthalpy: 0.355606 hartree
zpe.thermalcorrgfe: 0.273374 hartree
zpe.sumelectzpe: -1645.737440 hartree
zpe.sumelectthermal: -1645.712950 hartree
zpe.sumelectthermalent: -1645.712006 hartree
zpe.sumelectthermalfe: -1645.794238 hartree
dipole: 5.3271 2.9999 3.9897
dipole: 7.3003
quadrupole: -153.3628 -167.2237 -158.8508
quadrupole: -33.9856 -9.5625 2.2849
quadrupole: 6.4496 -7.4113 0.9616 -33.9856 -9.5625 2.2849
hfenergy: -1646.0676114 hartree
pointgroup: C01 [X(C13H18N5O7P1)]
dipole: 2.0431544 -1.0813297 -1.704573 debye
polarizability: 303.4717696|0.2334859|216.4123463|-10.7838245|0.3504326|142.4180934 unknown
InChI: InChI=1S/C13H18N5O7P/c14-11-8-12(16-5-15-11)18(6-17-8)13-10(20)9(19)7(25-13)4-24-26(21)22-2-1-3-23-26/h5-7,9-10,13,19-20H,1-4,14H2
charge 0 multiplicity 1
44 atoms
P  -5.016264 0.929867 0.630634
O  0.086228 1.485795 0.109708
O  -1.781534 -1.517439 -1.032413
O  0.839321 -2.082342 0.643281
O  -3.576812 1.105183 -0.336574
O  -6.13301 0.542092 -0.620299
O  -4.759419 -0.556295 1.490029
O  -5.398335 2.137534 1.566939
N  2.358988 0.774333 0.161212
N  4.195728 2.043539 -0.373512
N  3.458495 -1.46008 0.333972
N  5.865251 -1.339497 -0.11121
N  6.973616 0.67647 -0.640943
C  -1.046109 -0.670643 -0.102865
C  0.481302 -0.90097 -0.085591
C  -1.182313 0.853702 -0.392134
C  0.98482 0.419235 0.564741
C  -2.33428 1.566157 0.322912
C  3.442309 -0.106957 0.116168
C  2.871123 2.05245 -0.132638
C  4.565577 0.695022 -0.215688
C  -5.89177 -1.931289 -0.281081
C  -5.932983 -0.782393 -1.30315
C  -4.682592 -1.813423 0.66156
C  5.81802 0.021593 -0.327756
C  4.712306 -1.99405 0.200561
H  -1.456659 -0.925751 0.889188
H  0.855425 -0.918306 -1.139405
H  -1.252753 1.036038 -1.482241
H  0.942945 0.3296 1.669676
H  -2.24908 2.659689 0.201627
H  -2.331729 1.321915 1.402915
H  -1.313494 -1.541223 -1.905746
H  1.864053 -2.13219 0.611041
H  2.223669 2.923691 -0.168095
H  -6.829888 -1.942585 0.303219
H  -5.819743 -2.892171 -0.827619
H  -4.997465 -0.732355 -1.891954
H  -6.800133 -0.850945 -1.977569
H  -4.668747 -2.611346 1.420028
H  -3.734261 -1.811705 0.093124
H  4.799491 -3.071812 0.362505
H  6.960208 1.68181 -0.802383
H  7.841095 0.146852 -0.704374
