program: Gaussian 09
title: 000132481
version: EM64L-G09RevD.01
frameworkgroup: C1[X(C21H25N7O6)]
method: RPBEPBE
basis: SDD
operation: Freq
keyword: #p
keyword: freq=noraman
keyword: PBEPBE/SDD
title: #p freq=noraman PBEPBE/SDD
converged: YES YES NO NO
title: Mulliken charges:
elementType: O O O O O O N N N N N N N C C C C C C C C C C C C C C C C C C C C C H H H H H H H H H H H H H H H H H H H H H H H H H
charge: -0.290353 -0.299813 -0.398732 -0.239279 -0.414573 -0.247436 -0.179688 -0.127269 -0.387451 -0.431577 -0.027784 -0.622888 -0.442738 -0.015021 -0.399344 -0.460723 -0.531903 -0.489140 0.138227 0.253552 0.477720 -0.009412 -0.390660 -0.385292 0.122124 -0.384219 -0.384278 0.294369 0.145274 -0.132018 -0.378492 -0.511672 0.124440 0.226408 0.212622 0.231033 0.192801 0.236131 0.216459 0.306969 0.235331 0.224913 0.250900 0.296510 0.312704 0.307296 0.211244 0.212556 0.266891 0.351142 0.308215 0.332729 0.337357 0.208344 0.246488 0.289010 0.254074 0.385131 0.372786
chargesum: 0.00000
title: Mulliken charges with hydrogens summed into heavy atoms:
elementType: O O O O O O N N N N N N N C C C C C C C C C C C C C C C C C C C C C
charge: -0.290353 -0.299813 -0.013600 -0.239279 -0.041787 -0.247436 -0.179688 -0.127269 -0.090941 -0.118873 -0.027784 0.036469 -0.105380 0.197601 0.024491 -0.008132 0.010397 -0.013327 0.138227 0.253552 0.477720 -0.009412 -0.083364 -0.174048 0.122124 -0.171663 -0.117386 0.294369 0.145274 0.200711 0.076341 0.031411 0.124440 0.226408
polarizability: 4.40725407e+02 5.19476468e-01 3.23025426e+02 2.28672907e+01 2.36007870e-02 2.04816314e+02
1716.lowfreq: -4.0097 -0.0009 -0.0004 0.0004 2.7354 5.5223 9.3850 13.8708 24.7660
frequency: 9.2505 13.5577 24.7343 31.7858 35.8226 46.6036 49.1494 69.1573 69.9309 74.4599 85.5424 91.9686 105.6458 109.9038 149.2712 157.4283 168.5208 179.9946 196.3349 214.9922 227.7476 237.7299 244.1710 260.7736 282.2072 285.9854 300.1831 310.7396 323.4424 343.4242 348.1660 365.2729 382.2511 404.1581 409.2257 410.9883 439.9976 457.3816 463.6477 469.8738 480.9516 484.9106 502.4936 513.5135 518.9796 530.2904 535.3634 544.7900 548.8577 557.3082 570.5314 588.4278 590.8235 595.3683 602.1136 615.9218 627.3549 633.1150 640.4258 660.1811 682.8316 688.2848 690.9952 729.3056 733.9420 747.1321 756.6443 782.3542 810.1049 828.0294 840.3956 850.5727 853.6960 887.2515 911.5406 941.8404 961.0271 970.0454 973.8419 975.0752 980.3873 984.2766 989.2288 999.9022 1003.1550 1020.9048 1039.7315 1046.3970 1051.4944 1067.4202 1090.7056 1100.8798 1108.8184 1110.5737 1122.6268 1136.9884 1152.0707 1163.5338 1187.6920 1197.4472 1204.2763 1207.7509 1220.5672 1231.0359 1235.0054 1245.0432 1248.0255 1250.4383 1268.0190 1282.8224 1287.5064 1291.2422 1309.8727 1319.1513 1325.6620 1333.8774 1341.8630 1342.7248 1348.2043 1349.4515 1358.4966 1363.9034 1369.5518 1376.8375 1391.1673 1399.6840 1437.4362 1439.8748 1443.3578 1446.1163 1453.0542 1467.7077 1478.3165 1481.6940 1482.3225 1501.8812 1525.2594 1542.1144 1548.2016 1581.5448 1585.5967 1617.8108 1624.6109 1644.7789 1646.4902 1666.8872 2846.8826 2897.7172 2975.5932 2984.4009 2998.8258 3009.7144 3010.4684 3017.7867 3052.6021 3069.2636 3084.3627 3084.6330 3107.8735 3113.1368 3122.1984 3139.9862 3140.4251 3162.0399 3486.0995 3513.1082 3514.5598 3519.9929 3521.0355 3547.6130 3698.3255
redmass: 7.1466 6.2631 7.2195 6.6863 5.8632 5.9274 9.0952 6.9363 5.8010 7.8144 5.5975 6.1942 7.0876 4.4635 4.2564 5.7417 3.6785 6.1430 6.7235 5.5142 3.0081 3.1664 2.7394 3.5834 1.7780 3.1468 3.2793 3.4084 6.0968 3.2105 3.9240 4.6952 4.8423 3.6061 3.1591 3.4799 2.2764 3.4188 2.7167 3.3518 2.7876 1.8823 3.2923 1.8723 1.9976 2.5346 2.1927 2.0171 2.7386 3.8871 2.0603 3.5919 2.4409 2.5896 2.5186 2.3366 1.5857 5.9029 4.4641 4.0799 7.0438 3.8898 3.6241 3.5063 5.2248 8.4794 4.6442 2.7218 4.8967 1.4178 3.3464 1.8274 2.6160 2.2975 1.8588 3.5355 2.6751 3.4603 1.9998 1.6027 2.7473 1.4286 2.8583 3.0824 2.6897 2.3124 2.9675 2.2741 2.6758 2.3849 2.6269 2.6771 2.3426 3.8171 2.6994 1.5938 2.0078 2.8793 2.0023 1.3575 1.8467 2.2481 1.3132 1.3442 1.5119 1.3500 1.3434 2.1288 1.6157 1.8523 1.8076 1.3694 1.8520 1.2967 1.3920 1.3772 1.5072 1.6498 1.7302 1.4888 1.4912 1.5585 3.3644 1.8829 2.0541 2.0155 1.4633 1.8429 1.1427 1.7325 1.1212 1.3884 1.4602 2.2857 1.7174 1.1971 2.5240 7.1613 5.8005 1.8282 5.9325 2.4832 5.3916 4.1972 8.1671 8.0768 1.0812 1.0721 1.0711 1.0601 1.0637 1.0693 1.0626 1.0762 1.1020 1.0973 1.1032 1.0984 1.0925 1.0921 1.0886 1.0919 1.0908 1.0957 1.0764 1.0705 1.0701 1.0639 1.0773 1.0454 1.1046
irintensity: 0.3752 4.6045 0.4550 3.2916 0.3089 0.6415 0.5590 2.7341 3.2674 3.5988 0.9279 6.0382 4.9599 0.6386 2.0112 7.7648 2.7430 8.0066 2.9590 7.3692 6.5367 13.5956 6.5178 1.4045 49.6224 17.1831 26.5433 23.6095 11.4753 22.9063 13.3385 23.9359 21.9714 8.7318 1.4948 1.6092 194.7814 9.5040 13.3171 19.7869 40.8389 31.1930 20.8663 173.3166 70.7721 71.1070 89.6797 26.2194 38.2440 3.4716 83.3570 10.0896 41.6905 61.7754 24.0274 27.7193 166.2189 2.8793 7.0717 9.6827 7.2691 11.6483 75.0560 12.4365 15.9529 13.0535 25.1133 26.8701 5.9725 11.9167 3.1096 36.5185 11.8569 7.6192 33.7854 3.3152 32.6629 75.9095 8.9782 16.3445 24.5455 6.7616 41.4346 8.6455 6.8228 76.0688 322.0458 58.4252 158.2584 56.2413 57.1001 49.6612 61.5343 71.9026 4.2925 11.5242 3.1681 2.8540 51.5103 0.1583 85.3842 378.9995 11.7046 131.0746 2.6192 14.0049 24.5067 135.4693 4.5119 86.2402 90.8206 3.7046 13.8889 59.4404 4.2151 11.9405 35.7917 116.5770 139.3456 53.1318 13.4732 28.7820 5.5035 30.9559 58.0527 54.9424 33.9941 14.0799 9.8595 23.2681 64.8464 10.9060 249.1041 105.3191 220.7775 33.7864 154.3184 704.6697 54.6440 114.9171 205.7929 442.9932 333.0235 261.9751 146.0607 187.0066 67.3018 101.6142 68.2224 39.3908 22.5261 26.2069 40.1272 15.5759 44.4358 2.3374 31.4099 16.4988 19.7025 0.9502 35.9282 24.4737 37.8335 16.7827 4.4477 71.9346 5.9399 22.9762 20.7788 108.8046 39.0605
temp: 298.150 k
press: 1.00000 atm
elementType: 8 8 8 8 8 8 7 7 7 7 7 7 7 6 6 6 6 6 6 6 6 6 6 6 6 6 6 6 6 6 6 6 6 6 1 1 1 1 1 1 1 1 1 1 1 1 1 1 1 1 1 1 1 1 1 1 1 1 1
symmnumber: 1
zpe: 1211208.0 jmol-1
zpe.correction: 0.461325 hartree
zpe.thermalcorrener: 0.492702 hartree
zpe.thermalcorrenthalpy: 0.493646 hartree
zpe.thermalcorrgfe: 0.395296 hartree
zpe.sumelectzpe: -1647.379985 hartree
zpe.sumelectthermal: -1647.348607 hartree
zpe.sumelectthermalent: -1647.347663 hartree
zpe.sumelectthermalfe: -1647.446014 hartree
dipole: 13.6634 -1.4265 4.6209
dipole: 14.4940
quadrupole: -122.2151 -175.6235 -196.3340
quadrupole: -17.2624 17.4044 9.6044
quadrupole: 42.5091 -10.8993 -31.6098 -17.2624 17.4044 9.6044
hfenergy: -1647.8413096 hartree
pointgroup: C01 [X(C21H25N7O6)]
dipole: -5.4031662 -0.8604122 -1.6069873 debye
polarizability: 441.7367148|4.6284944|322.6018562|15.806903|-7.9133889|204.2285766 unknown
InChI: InChI=1S/C21H25N7O6/c22-21-25-17-16(19(32)26-21)28-10-27(8-7-13(28)9-23-17)12-3-1-11(2-4-12)18(31)24-14(20(33)34)5-6-15(29)30/h1-4,13-14,23-25,29,33H,5-10,22H2
charge 0 multiplicity 1
59 atoms
O  -2.821465 1.901986 0.817792
O  4.457078 -1.361419 0.165765
O  6.874426 2.995879 0.751587
O  4.643291 3.279689 1.318552
O  6.362461 -2.013045 -2.661046
O  7.548779 -0.68318 -1.176984
N  -3.675659 -0.874949 0.44331
N  -1.850502 -1.820873 1.755996
N  -5.973606 -1.148799 -1.2883
N  -6.295285 1.214993 -1.203603
N  -4.840218 2.703251 -0.034592
N  -6.748648 3.542126 -1.117064
N  3.92787 0.898807 0.190199
C  -4.258734 -2.216406 0.177269
C  -3.158403 -3.299775 0.260286
C  -2.371993 -3.194798 1.592601
C  -2.939096 -0.845885 1.747093
C  -4.950277 -2.209624 -1.207472
C  -4.42433 0.257575 0.02108
C  -5.567259 0.092068 -0.761282
C  -0.538982 -1.469393 1.358809
C  -3.955798 1.649496 0.28659
C  -0.220801 -0.14139 0.934127
C  0.524512 -2.424384 1.412085
C  -5.931502 2.482528 -0.754618
C  1.100878 0.204327 0.60642
C  1.835621 -2.066125 1.065852
C  2.158363 -0.743511 0.666226
C  3.582081 -0.443336 0.32768
C  5.320265 1.310175 -0.017696
C  5.697639 1.522694 -1.520102
C  5.570072 0.236351 -2.354773
C  5.538075 2.605188 0.756619
C  6.589847 -0.818347 -1.969024
H  -5.038237 -2.443567 0.949384
H  -2.454846 -3.173136 -0.584236
H  -3.625498 -4.301101 0.174876
H  -1.559354 -3.934048 1.617502
H  -3.047949 -3.417461 2.44379
H  -2.579555 0.174464 1.925975
H  -3.643025 -1.128705 2.565121
H  -5.42589 -3.186887 -1.396723
H  -4.188772 -2.040047 -1.990543
H  -6.944872 -1.433518 -1.130437
H  -6.923032 1.088444 -2.000925
H  -1.003858 0.616857 0.830722
H  0.337761 -3.4473 1.753576
H  1.280745 1.229538 0.259874
H  2.646004 -2.801497 1.108677
H  -6.43034 4.465144 -0.829743
H  -7.715341 3.414393 -1.40519
H  5.990271 0.525783 0.384504
H  3.285338 1.633109 0.500785
H  5.035263 2.297877 -1.950024
H  6.736831 1.894187 -1.558289
H  4.565741 -0.211353 -2.265411
H  5.714076 0.46604 -3.428878
H  6.972505 3.846749 1.259223
H  7.013932 -2.696061 -2.345393
