program: Gaussian 09
title: 000132430
version: EM64L-G09RevD.01
frameworkgroup: C1[X(C10H15Br2Cl3)]
method: RPBEPBE
basis: SDD
operation: Freq
keyword: #p
keyword: freq=noraman
keyword: PBEPBE/SDD
title: #p freq=noraman PBEPBE/SDD
converged: YES YES NO NO
title: Mulliken charges:
elementType: Br Br Cl Cl Cl C C C C C C C C C C H H H H H H H H H H H H H H H
charge: -0.049206 0.003862 -0.080664 -0.035336 -0.040937 -0.362520 -0.459523 -0.370712 -0.016666 -0.115542 -0.666052 -0.649243 -0.692304 0.184992 -0.564086 0.252305 0.259586 0.321230 0.243019 0.258448 0.235858 0.239399 0.247664 0.239738 0.240356 0.242317 0.311847 0.324327 0.252222 0.245623
chargesum: 0.00000
title: Mulliken charges with hydrogens summed into heavy atoms:
elementType: Br Br Cl Cl Cl C C C C C C C C C C
charge: -0.049206 0.003862 -0.080664 -0.035336 -0.040937 0.149371 -0.138293 0.130755 -0.016666 -0.115542 0.056868 0.073167 -0.056131 0.184992 -0.066240
polarizability: 1.71356182e+02 -9.89768752e-01 1.95599935e+02 -3.18335857e-01 -1.54761724e+01 1.40708266e+02
1716.lowfreq: -11.8144 -3.2319 -0.0011 0.0005 0.0005 2.2248 12.5887 26.6903 49.3629
frequency: 9.7198 26.6414 49.3617 54.1417 57.8558 75.2476 111.9592 116.6167 137.9185 165.0726 193.3389 206.1608 214.3310 220.8081 230.1164 253.9063 268.3660 279.3416 315.7280 321.1427 335.9444 367.7352 395.6960 413.8154 459.0095 491.7076 519.5435 523.6497 579.2540 588.9701 619.0195 640.5315 687.7463 773.8519 816.4169 821.9314 879.4118 931.3092 940.2653 963.3033 983.3447 1002.7264 1005.9818 1068.4109 1091.2946 1099.4577 1111.0099 1141.3474 1160.0636 1196.4020 1225.5386 1238.4037 1244.7770 1246.3085 1287.9327 1308.3987 1346.6589 1372.7426 1386.5599 1401.0424 1405.7934 1439.5220 1451.2886 1452.9214 1457.8014 1461.3113 1471.5666 1484.6503 1637.9807 2985.8734 2995.0095 2998.2990 2999.9816 3049.4543 3064.3663 3076.0108 3088.0105 3091.9765 3096.6954 3108.4496 3115.5118 3128.0722 3174.7522 3233.8811
redmass: 15.1417 12.5809 12.7010 5.1797 7.1788 6.8841 17.4787 7.0823 4.9117 9.0091 3.3220 2.7920 2.3289 5.6106 2.0874 1.5031 2.8987 1.9871 3.8096 2.8668 3.2315 2.9884 3.6584 3.1867 5.8316 3.7853 4.1599 3.3652 5.2669 3.0014 3.1533 3.1999 1.2452 3.0044 2.3323 1.6872 1.8147 1.3461 1.4513 2.2730 1.8505 1.4516 1.5603 2.3532 2.3746 1.5318 1.6278 1.4398 2.3257 2.6148 1.4246 1.2376 1.6031 2.7403 1.5931 1.1293 1.4168 1.5040 1.2222 1.1936 1.1767 1.0832 1.0717 1.0603 1.0631 1.0720 1.0586 1.0520 5.7243 1.0593 1.0371 1.0365 1.0584 1.0976 1.0937 1.0976 1.0569 1.0971 1.0988 1.1007 1.1004 1.0629 1.1111 1.1150
irintensity: 0.0960 0.0617 0.5008 0.4189 1.5980 0.4293 0.3167 2.8997 3.1461 4.5114 0.3790 1.7099 1.5835 0.3556 3.7071 0.1149 3.6145 1.7925 3.7152 1.6418 4.9007 3.6989 6.1810 5.0175 12.4848 2.7556 27.6610 44.6109 73.8880 1.9530 5.3868 7.7885 2.8439 13.4688 9.6379 52.6466 8.7077 51.2834 0.6702 10.6896 7.2078 7.5715 2.6235 8.1610 8.7521 42.0282 52.4448 2.4634 5.6346 12.9577 29.9740 6.1725 22.8308 30.4800 16.7303 0.5293 3.9176 0.3104 32.5179 24.9959 27.5515 25.6197 5.7795 9.4897 4.4542 3.4625 12.8270 16.2953 23.2258 1.7435 8.8937 7.8129 15.6798 1.1411 0.7582 12.2600 3.8263 6.9944 14.0542 13.9041 26.4585 0.6594 0.2708 2.1910
temp: 298.150 k
press: 1.00000 atm
elementType: 35 35 17 17 17 6 6 6 6 6 6 6 6 6 6 1 1 1 1 1 1 1 1 1 1 1 1 1 1 1
symmnumber: 1
zpe: 594810.0 jmol-1
zpe.correction: 0.226551 hartree
zpe.thermalcorrener: 0.245882 hartree
zpe.thermalcorrenthalpy: 0.246826 hartree
zpe.thermalcorrgfe: 0.174760 hartree
zpe.sumelectzpe: -1795.968144 hartree
zpe.sumelectthermal: -1795.948813 hartree
zpe.sumelectthermalent: -1795.947869 hartree
zpe.sumelectthermalfe: -1796.019934 hartree
dipole: 2.0699 -0.9076 0.6782
dipole: 2.3598
quadrupole: -132.2425 -144.9389 -124.1695
quadrupole: -1.2531 -4.8173 -0.4881
quadrupole: 1.5411 -11.1552 9.6141 -1.2531 -4.8173 -0.4881
hfenergy: -1796.1946948 hartree
pointgroup: C01 [X(C10H15Br2Cl3)]
dipole: -0.7614012 -0.4429337 -0.293268 debye
polarizability: 170.9349246|-0.9953315|199.4545435|3.7617388|3.6557669|137.2749154 unknown
InChI: InChI=1S/C10H15Br2Cl3/c1-7(13)10(15,6-11)5-4-8(12)9(2,3)14/h8H,1,4-6H2,2-3H3
charge 0 multiplicity 1
30 atoms
Br -1.987002 -2.380536 -0.806063
Br 2.126586 -1.747699 2.09999
Cl -3.258134 2.069829 -0.112243
Cl 1.678432 2.330935 -0.086936
Cl 4.677795 0.690059 -0.000008
C  -0.713917 0.070067 0.216041
C  -1.97004 -0.313448 -0.578553
C  0.587742 -0.231086 -0.554902
C  -3.333201 0.109022 0.02632
C  1.86459 0.375892 0.066356
C  -3.51519 -0.208333 1.513307
C  -4.543209 -0.287845 -0.829573
C  1.994506 0.214398 1.586862
C  3.118128 0.027604 -0.708866
C  3.204065 -0.709799 -1.837575
H  -0.782753 1.158426 0.41285
H  -0.715038 -0.459855 1.185216
H  -1.912948 0.028349 -1.626109
H  0.500182 0.145672 -1.590705
H  0.727686 -1.327298 -0.606665
H  -3.495371 -1.30496 1.656895
H  -4.487372 0.173965 1.865166
H  -2.723909 0.242136 2.133231
H  -4.723118 -1.374309 -0.746429
H  -4.382165 -0.040999 -1.892758
H  -5.441831 0.245483 -0.478606
H  1.111287 0.59748 2.113208
H  2.915365 0.674039 1.968362
H  4.165261 -0.912277 -2.316564
H  2.310775 -1.139213 -2.29935
