program: Gaussian 09
title: 000132428
version: EM64L-G09RevD.01
frameworkgroup: C1[X(C11H18N8)]
method: RPBEPBE
basis: SDD
operation: Freq
keyword: #pfreq=noraman
keyword: PBEPBE/SDD
title: #p freq=noraman PBEPBE/SDD
converged: YES YES NO NO
title: Mulliken charges:
elementType: N N N N N N N N C C C C C C C C C C C H H H H H H H H H H H H H H H H H H
charge: -0.080444 -0.030598 -0.003476 -0.631518 -0.047883 -0.097126 -0.618032 -0.584478 -0.404843 -0.536587 -0.332997 0.097669 0.034646 -0.113612 -0.614980 -0.626067 -0.032565 0.137396 -0.048960 0.216089 0.235191 0.198827 0.236031 0.179226 0.204731 0.223472 0.187433 0.223120 0.185578 0.237142 0.220703 0.332553 0.328366 0.324350 0.345170 0.325468 0.331007
chargesum: 0.00000
title: Mulliken charges with hydrogens summed into heavy atoms:
elementType: N N N N N N N N C C C C C C C C C C C
charge: -0.080444 -0.030598 -0.003476 0.029401 -0.047883 -0.097126 0.051489 0.071997 0.046436 -0.101729 0.050959 0.097669 0.034646 -0.113612 0.019044 0.017355 -0.032565 0.137396 -0.048960
polarizability: 2.96450281e+02 2.58642976e+01 1.82450788e+02 -2.85172066e+01 8.37121158e+00 1.12727208e+02
1716.lowfreq: -17.8428 -0.0008 -0.0004 -0.0003 2.2567 4.1403 18.2183 26.5619 30.9975
frequency: 10.7386 26.5026 30.9570 73.3062 92.4427 112.9937 129.5703 158.2790 190.2291 207.7670 216.2322 227.1200 241.9983 282.8550 286.4182 297.8890 308.7397 332.5196 359.0849 379.8831 394.9145 419.0225 454.4747 458.8059 463.0557 484.3561 512.2444 528.2166 548.2893 550.8936 566.5491 578.6514 613.9707 655.0950 667.5186 672.3582 720.6206 747.6082 761.0960 765.0889 801.7071 815.1894 828.6448 870.8603 923.9992 1010.9205 1020.1969 1024.2863 1033.1762 1044.1512 1057.6768 1072.7176 1092.8356 1118.2022 1131.2150 1152.1785 1176.3749 1196.7948 1220.4565 1256.2916 1268.9064 1274.4079 1285.5986 1297.2483 1316.3286 1333.0063 1352.1125 1374.3173 1407.2708 1418.6062 1428.0051 1441.9966 1458.4367 1460.5901 1462.7521 1467.2820 1474.9453 1476.5287 1478.0561 1483.1422 1489.0116 1508.0951 1543.5648 1557.9870 1593.3367 1612.8641 1618.3428 2817.3592 2843.3772 2859.3692 2959.7370 2991.1008 2995.1468 3017.8163 3032.6595 3039.2335 3063.6359 3076.5948 3089.9162 3527.3170 3544.6594 3559.5720 3690.6325 3705.5889 3721.6945
redmass: 3.0597 3.5140 4.7755 3.7762 2.9208 3.7948 2.3635 3.8717 4.3929 5.8964 3.1450 1.1951 1.1507 6.6953 3.5071 2.8286 2.6057 2.1985 1.3060 3.3580 2.6787 2.8553 1.5515 2.1000 3.3492 2.9863 2.9288 1.6530 4.2150 1.1175 2.0263 2.6749 1.0648 6.7229 6.0920 7.6104 9.9890 1.3555 5.0643 4.1836 4.9886 11.4653 2.8364 1.8047 2.4152 2.6070 2.2178 3.2939 1.6847 2.6462 1.8117 2.1090 1.3952 1.3653 2.1785 1.7287 3.4916 2.7712 1.7231 1.9776 1.9782 1.3779 4.8296 1.2274 2.7888 1.6852 8.3560 1.4000 5.6950 1.1451 5.8144 1.1612 1.3153 1.1086 1.1413 3.3138 1.1302 2.0017 1.0858 1.0834 1.0859 2.9763 3.9571 3.2277 1.6363 1.5461 1.8849 1.0698 1.0575 1.0575 1.0652 1.0688 1.0771 1.0720 1.0723 1.0945 1.1023 1.1010 1.1003 1.0442 1.0456 1.0439 1.1050 1.1034 1.1060
irintensity: 0.1880 0.1207 0.1082 0.2604 2.5572 9.8703 2.8337 1.1937 1.3723 6.8534 3.7526 0.4536 0.5953 0.9186 3.0988 7.1091 11.1318 16.9969 113.8951 0.9345 19.0358 0.9681 43.2469 200.9164 39.2645 15.1963 5.0962 280.9683 7.2540 0.2652 60.4275 29.2419 42.7464 2.9559 12.0495 4.2446 12.7430 3.0236 2.4665 2.7399 7.1288 13.4541 17.8494 2.0747 12.1897 17.1362 5.7473 3.6057 14.3781 11.7879 32.0081 21.8497 6.3352 3.8961 0.1401 3.7472 6.0607 25.4096 15.6256 3.1761 7.1335 2.9063 3.2257 9.2217 16.5987 7.8616 163.6601 14.9980 112.9301 1.9483 49.4757 5.6404 74.6562 5.5453 51.3607 112.8072 44.3717 168.6797 20.9055 3.9886 21.3649 308.3698 191.3421 447.3859 747.7528 425.2270 44.9619 70.3818 70.5339 228.7322 33.3593 8.3530 42.6401 47.3758 39.1912 9.2906 39.7612 37.8787 44.9607 81.8038 93.4301 160.2380 61.1399 40.3441 46.1483
temp: 298.150 k
press: 1.00000 atm
elementType: 7 7 7 7 7 7 7 7 6 6 6 6 6 6 6 6 6 6 6 1 1 1 1 1 1 1 1 1 1 1 1 1 1 1 1 1 1
symmnumber: 1
zpe: 794286.8 jmol-1
zpe.correction: 0.302528 hartree
zpe.thermalcorrener: 0.321619 hartree
zpe.thermalcorrenthalpy: 0.322563 hartree
zpe.thermalcorrgfe: 0.253629 hartree
zpe.sumelectzpe: -866.581190 hartree
zpe.sumelectthermal: -866.562099 hartree
zpe.sumelectthermalent: -866.561155 hartree
zpe.sumelectthermalfe: -866.630088 hartree
dipole: 3.1924 -2.0169 -1.1208
dipole: 3.9389
quadrupole: -94.6236 -103.7117 -114.6466
quadrupole: 7.9066 -5.2756 -0.9508
quadrupole: 9.7037 0.6156 -10.3193 7.9066 -5.2756 -0.9508
hfenergy: -866.8837176 hartree
pointgroup: C01 [X(C11H18N8)]
dipole: -1.2595517 0.7154781 -0.5506202 debye
polarizability: 297.1394913|29.5517183|177.7253691|21.9506471|-19.5047861|116.763416 unknown
InChI: InChI=1S/C11H18N8/c1-19(2)5-3-4-6-8(12)16-10-7(15-6)9(13)17-11(14)18-10/h3-5,12-14H2,1-2H3
charge 0 multiplicity 1
37 atoms
N  -5.286287 0.330072 0.631481
N  0.451713 0.579604 -0.787909
N  1.321899 -1.851841 0.444538
N  -0.811926 -2.736686 0.19266
N  3.50405 -0.952172 0.6977
N  3.991733 1.344358 -0.096301
N  2.308366 2.649549 -1.102387
N  5.619582 0.008253 0.904647
C  -2.837591 0.038705 0.078857
C  -1.844981 -0.251676 -1.084093
C  -4.272031 0.253461 -0.446326
C  -0.415234 -0.436953 -0.621171
C  0.048354 -1.670819 0.012809
C  1.744914 0.41325 -0.350097
C  -6.660975 0.246311 0.095087
C  -5.117423 1.506032 1.510486
C  2.204531 -0.804918 0.271934
C  2.710708 1.482082 -0.513222
C  4.31361 0.125628 0.488904
H  -2.854098 -0.790937 0.811778
H  -2.478658 0.934907 0.617857
H  -2.187973 -1.142117 -1.652623
H  -1.856372 0.600713 -1.787422
H  -4.288699 1.16777 -1.099759
H  -4.545457 -0.603827 -1.09405
H  -6.779121 -0.686462 -0.485267
H  -6.93307 1.104785 -0.5717
H  -7.384578 0.222478 0.929521
H  -5.200791 2.479735 0.961487
H  -4.134966 1.476678 2.01034
H  -5.893394 1.489371 2.296284
H  -0.434476 -3.571995 0.6374
H  -1.795744 -2.688574 -0.051853
H  2.973887 3.408185 -1.226069
H  1.338751 2.721573 -1.408871
H  6.256509 0.787646 0.767362
H  5.916836 -0.86077 1.339889
