program: Gaussian 09
title: 000132426
version: EM64L-G09RevD.01
frameworkgroup: C1[X(C9H14N8)]
method: RPBEPBE
basis: SDD
operation: Freq
keyword: #pfreq=noraman
keyword: PBEPBE/SDD
title: #p freq=noraman PBEPBE/SDD
converged: NO YES NO NO
title: Mulliken charges:
elementType: N N N N N N N N C C C C C C C C C H H H H H H H H H H H H H H
charge: -0.164207 -0.031966 0.008753 -0.047496 -0.628290 -0.099167 -0.619497 -0.584615 -0.464486 0.056695 -0.124381 0.027534 -0.031199 -0.604981 -0.612921 0.139468 -0.049062 0.226380 0.238117 0.228164 0.232596 0.203139 0.225069 0.203829 0.252127 0.311497 0.385772 0.323674 0.344005 0.324736 0.330713
chargesum: 0.00000
title: Mulliken charges with hydrogens summed into heavy atoms:
elementType: N N N N N N N N C C C C C C C C C
charge: -0.164207 -0.031966 0.008753 -0.047496 0.068979 -0.099167 0.048182 0.070833 0.000010 0.056695 -0.124381 0.027534 -0.031199 0.058917 0.068105 0.139468 -0.049062
polarizability: 2.77320948e+02 7.79145251e+00 1.62081340e+02 1.07568243e+01 -1.56732984e+00 8.50863819e+01
1716.lowfreq: -18.3324 -7.4064 -6.7169 -0.0006 -0.0006 0.0001 40.2012 53.0647 85.2509
frequency: 39.5141 52.8717 85.1571 123.0930 125.9956 193.3150 206.8414 210.4983 221.1166 232.3924 281.2684 284.2816 306.7615 311.5484 355.4690 370.1884 384.7126 427.1969 453.9781 460.5721 471.4310 520.0681 522.8679 551.0508 552.9055 574.1526 583.8421 608.0292 657.1865 670.4733 699.1352 719.4588 747.6997 761.9939 794.4200 810.0848 837.0918 859.8716 925.4368 976.2417 1009.4714 1025.0690 1033.6377 1075.9610 1087.9992 1129.8003 1135.4401 1164.5662 1186.0946 1214.1139 1250.2844 1253.9335 1285.8383 1314.8158 1344.0506 1354.8878 1407.9991 1418.4002 1434.7533 1445.5222 1452.1986 1457.4406 1461.2957 1471.7098 1474.2504 1477.5926 1487.1580 1507.5342 1544.7825 1555.5892 1586.0285 1596.6425 1616.7194 2893.3630 2903.6924 2918.5578 2994.5162 3031.8761 3039.9037 3086.2738 3093.8136 3200.6146 3529.2789 3559.5389 3606.9922 3692.3781 3721.9168
redmass: 3.9582 3.3117 3.1657 5.4949 4.4192 3.9331 4.1611 3.0541 1.2363 1.2382 6.7460 3.5386 2.6419 2.7072 2.9661 2.9657 3.2917 2.6738 1.3055 2.4556 5.1850 4.6448 1.5903 1.0692 5.1930 4.2031 1.4130 1.0617 8.7762 9.4484 5.2318 8.6914 8.6854 4.9762 6.3583 9.0203 4.4141 1.1007 2.5003 2.0218 2.4089 2.4913 1.5986 2.5541 1.3045 2.0572 1.4875 2.0001 4.0997 2.7598 2.1246 1.8363 5.1895 3.6346 2.9348 2.6721 5.5398 1.1431 1.2824 4.0601 1.1430 2.7452 1.1206 1.1632 1.1248 2.2528 1.0595 2.9860 2.8918 2.5506 1.6144 2.1335 2.1117 1.0527 1.0526 1.0622 1.0956 1.0780 1.0792 1.1015 1.1014 1.0658 1.0441 1.0438 1.0875 1.1050 1.1060
irintensity: 0.6137 1.1733 1.6313 5.5580 2.1336 1.0574 5.8966 3.5508 4.6568 2.1077 1.7074 4.1319 9.0470 9.0105 8.2147 17.5718 5.3215 0.0152 93.2599 197.4299 7.5990 10.1523 223.9546 1.6986 3.4486 14.5876 155.5039 40.8917 2.8149 18.1275 17.0290 12.6954 4.3759 5.5954 21.6355 6.2794 14.4716 91.2733 13.0143 36.5043 33.6510 35.1552 14.3845 27.1335 5.0885 0.0902 1.8725 4.9896 3.7282 10.5499 6.6854 4.7416 2.5759 27.8423 91.4051 39.8436 119.4600 4.7053 7.8714 6.7454 8.8521 78.8932 13.9431 48.6642 58.9077 194.6935 15.4830 337.8844 412.5768 480.8408 255.9448 677.8620 200.6264 83.2351 116.7040 93.3971 18.0608 33.9373 30.6244 22.2737 39.5024 565.2178 77.8074 158.0646 67.3585 58.6363 45.7815
temp: 298.150 k
press: 1.00000 atm
elementType: 7 7 7 7 7 7 7 7 6 6 6 6 6 6 6 6 6 1 1 1 1 1 1 1 1 1 1 1 1 1 1
symmnumber: 1
zpe: 649001.1 jmol-1
zpe.correction: 0.247191 hartree
zpe.thermalcorrener: 0.263060 hartree
zpe.thermalcorrenthalpy: 0.264004 hartree
zpe.thermalcorrgfe: 0.204720 hartree
zpe.sumelectzpe: -788.144586 hartree
zpe.sumelectthermal: -788.128717 hartree
zpe.sumelectthermalent: -788.127773 hartree
zpe.sumelectthermalfe: -788.187057 hartree
dipole: -3.6419 2.9548 0.3077
dipole: 4.6999
quadrupole: -70.9890 -95.0006 -101.6976
quadrupole: 3.1362 0.5977 -1.1316
quadrupole: 18.2400 -5.7716 -12.4685 3.1362 0.5977 -1.1316
hfenergy: -788.3917771 hartree
pointgroup: C01 [X(C9H14N8)]
dipole: -1.4435117 1.1444877 -0.1599863 debye
polarizability: 277.6262777|9.8724386|154.7803063|0.1860734|-23.1009029|92.0820866 unknown
InChI: InChI=1S/C9H14N8/c1-17(2)3-4-6(10)14-8-5(13-4)7(11)15-9(12)16-8/h3,10-12H2,1-2H3
charge 0 multiplicity 1
31 atoms
N  -3.73236 0.199217 0.309794
N  -0.271905 0.993011 -0.519399
N  0.252602 -1.66226 0.441299
N  2.583642 -1.220655 0.385996
N  -2.071453 -2.028569 0.491481
N  3.409423 1.013049 -0.301408
N  1.900598 2.705445 -0.938368
N  4.856771 -0.70288 0.329818
C  -2.687463 0.56221 -0.698715
C  -1.284958 0.138528 -0.300106
C  1.008688 0.548964 -0.276469
C  -1.007809 -1.20339 0.221369
C  1.292089 -0.791547 0.183182
C  -5.099003 0.377683 -0.234538
C  -3.548034 0.927322 1.589686
C  2.136346 1.428666 -0.505244
C  3.556383 -0.298977 0.132027
H  -2.665476 1.656291 -0.907748
H  -2.964405 0.047921 -1.64213
H  -5.841154 0.043332 0.511483
H  -5.222229 -0.237014 -1.143584
H  -5.324974 1.438964 -0.496693
H  -4.285058 0.567752 2.328915
H  -3.671111 2.030055 1.47433
H  -2.536918 0.734068 1.986187
H  -1.875457 -2.957184 0.863249
H  -3.00761 -1.576499 0.509963
H  2.682584 3.331435 -1.112111
H  0.933912 2.985491 -1.099339
H  5.612762 -0.047319 0.154806
H  5.02918 -1.65271 0.647767
