program: Gaussian 09
title: 000132412
version: EM64L-G09RevD.01
frameworkgroup: C1[X(C15H21N3O)]
method: RPBEPBE
basis: SDD
operation: Freq
keyword: #p
keyword: freq=noraman
keyword: PBEPBE/SDD
title: #p freq=noraman PBEPBE/SDD
converged: YES YES NO NO
title: Mulliken charges:
elementType: O N N N C C C C C C C C C C C C C C C H H H H H H H H H H H H H H H H H H H H H
charge: -0.263181 -0.202959 -0.087083 -0.060105 -0.176687 0.388358 0.378996 -0.218652 -0.361147 -0.431112 -0.401033 -0.376042 -0.337645 -0.639296 -0.615609 -0.618559 -0.239239 -0.230562 -0.240337 0.195703 0.178687 0.204936 0.176455 0.227488 0.274136 0.254642 0.274659 0.255509 0.267157 0.230134 0.243720 0.219190 0.235277 0.185781 0.227174 0.186953 0.216642 0.225683 0.224929 0.227042
chargesum: 0.00000
title: Mulliken charges with hydrogens summed into heavy atoms:
elementType: O N N N C C C C C C C C C C C C C C C
charge: -0.263181 -0.202959 -0.087083 -0.060105 0.019015 0.388358 0.378996 0.164971 0.042796 -0.156975 -0.146390 -0.101383 -0.082136 0.101715 0.024638 0.012211 -0.013557 -0.005633 -0.013295
polarizability: 1.98497914e+02 1.07521911e+01 2.02030102e+02 4.68198635e+00 4.19914541e+00 1.40003265e+02
1716.lowfreq: -7.3417 -6.2009 0.0004 0.0005 0.0005 7.7009 19.5910 22.1239 27.7591
frequency: 19.5277 21.9432 27.3993 31.7540 50.5431 65.3428 85.3988 89.8188 99.6203 182.0122 198.3434 205.4542 219.3710 236.5627 247.1397 258.9875 278.6106 305.8246 319.6466 372.5123 392.5875 403.8405 411.6727 464.5983 466.6422 572.5887 609.2504 616.3444 630.3395 652.3988 690.1465 702.2626 740.5841 754.4245 803.0170 815.2487 830.8230 857.3537 864.9923 875.2249 912.3530 933.9652 948.7095 956.5002 981.5017 984.8714 989.7624 998.6308 1026.8167 1034.9400 1037.0797 1039.0782 1049.9562 1083.5236 1086.0025 1094.2167 1121.1103 1133.4561 1138.5525 1171.8575 1173.7049 1185.6390 1189.5881 1198.1548 1231.3830 1256.4816 1265.8573 1272.8171 1295.1414 1300.2197 1305.2693 1326.9609 1360.0183 1375.0425 1379.6946 1385.0156 1420.1031 1425.3087 1435.3598 1436.1036 1457.7592 1459.8829 1462.8890 1471.7776 1474.9649 1476.2956 1477.9236 1481.1711 1481.9947 1485.7060 1527.9365 1593.3054 1613.1817 2837.8665 2842.1454 2860.5915 2877.6479 2935.0609 2989.2959 2990.8860 3018.6523 3020.5356 3045.6634 3072.0072 3075.7974 3081.7768 3121.5640 3129.9266 3132.9346 3141.7406 3152.7335 3163.9315 3221.1445 3245.7877
redmass: 3.8560 3.5338 3.9880 3.6213 2.7850 5.1022 3.6175 1.0823 3.8596 4.0055 3.2232 3.5429 1.9591 1.2588 1.4474 4.5307 1.8873 4.2320 4.9843 2.6372 2.3818 2.8487 2.1613 3.1946 3.6108 3.3601 5.7512 6.1351 5.5466 4.5162 4.7624 2.1272 1.6978 3.3988 1.4943 2.5382 3.2901 1.2503 2.1114 1.6132 4.9523 1.5947 2.1047 2.9701 1.3888 2.8966 4.7121 1.3857 2.2601 1.7619 1.9567 1.7951 1.8439 1.9491 1.6769 1.4772 1.3113 1.4276 2.1201 1.0563 1.5176 1.6722 1.2904 1.9610 1.4294 2.9577 1.7201 1.9569 2.7132 1.5349 1.6851 1.4095 1.3363 1.6289 3.3828 4.3388 1.1448 1.6785 1.1595 1.9618 1.1599 1.9626 1.0534 1.0857 1.0456 1.0610 1.0906 1.2617 1.9607 1.0574 5.3349 6.2459 5.9985 1.0580 1.0659 1.0616 1.0803 1.0579 1.0391 1.0993 1.0716 1.0715 1.0880 1.1015 1.1007 1.1007 1.0845 1.0880 1.0983 1.0928 1.0960 1.1013 1.0930 1.1046
irintensity: 0.4025 0.1917 0.9023 0.0892 0.3131 0.4513 0.5720 0.0415 0.4066 2.6579 6.3731 2.4644 2.7839 2.4725 1.0408 1.2687 4.4392 3.2423 6.4417 5.7831 3.0113 0.3054 0.4673 10.5314 4.8520 7.0324 2.2125 1.8186 4.6210 3.8446 3.4791 28.9807 76.9358 15.3186 38.8452 30.4249 6.5968 0.5546 2.7860 0.2632 9.2240 8.8672 34.0242 51.2311 1.1200 17.8802 1.6654 1.5109 29.6653 34.5870 29.7675 39.9590 35.5618 8.8740 5.0912 12.3579 0.8084 7.3164 6.4624 0.2310 7.8812 9.1865 9.3228 1.2342 14.0276 7.0358 19.4857 20.9413 12.5542 16.2039 9.9900 3.9879 11.9060 1.3080 16.9996 11.4787 3.0641 5.1159 4.5573 16.8231 11.0748 12.8022 12.9212 2.9534 14.7566 15.6892 10.9553 36.2701 16.1859 12.4211 1.3379 0.1475 5.2395 82.2884 62.2727 277.4516 33.9503 63.5385 27.6015 64.3361 30.1349 53.3013 17.1623 21.7638 27.5969 49.1128 0.8467 4.7652 4.4256 25.1679 21.1816 24.9288 4.9065 1.3235
temp: 298.150 k
press: 1.00000 atm
elementType: 8 7 7 7 6 6 6 6 6 6 6 6 6 6 6 6 6 6 6 1 1 1 1 1 1 1 1 1 1 1 1 1 1 1 1 1 1 1 1 1
symmnumber: 1
zpe: 878258.6 jmol-1
zpe.correction: 0.334511 hartree
zpe.thermalcorrener: 0.354048 hartree
zpe.thermalcorrenthalpy: 0.354992 hartree
zpe.thermalcorrgfe: 0.282948 hartree
zpe.sumelectzpe: -822.176525 hartree
zpe.sumelectthermal: -822.156988 hartree
zpe.sumelectthermalent: -822.156044 hartree
zpe.sumelectthermalfe: -822.228088 hartree
dipole: 2.3386 0.2832 1.6404
dipole: 2.8705
quadrupole: -108.4063 -115.0149 -108.6622
quadrupole: -8.5369 -1.3604 -0.7883
quadrupole: 2.2881 -4.3204 2.0323 -8.5369 -1.3604 -0.7883
hfenergy: -822.5110361 hartree
pointgroup: C01 [X(C15H21N3O1)]
dipole: 0.8347977 0.4914404 0.5805573 debye
polarizability: 191.4895156|6.532705|209.5581017|-0.106461|1.5692148|139.4836638 unknown
InChI: InChI=1S/C15H21N3O/c1-17(2)11-12-19-15(13-7-5-4-6-8-13)14-9-10-16-18(14)3/h4-10,15H,11-12H2,1-3H3
charge 0 multiplicity 1
40 atoms
O  1.004613 0.095737 -0.456578
N  -1.09667 -2.624282 0.910723
N  3.779255 1.370369 -0.065367
N  -1.469342 -3.832563 0.318433
C  -0.159284 -0.310556 0.349127
C  -0.623797 -1.702637 -0.017408
C  -1.218353 0.785042 0.175956
C  2.2402 -0.622255 -0.110277
C  3.401482 0.125938 -0.773906
C  -0.689567 -2.337091 -1.271277
C  -2.594648 0.482408 0.048307
C  -0.803253 2.141179 0.199229
C  -1.209882 -3.639096 -1.012639
C  -1.247407 -2.470364 2.35941
C  4.359577 2.39133 -0.959301
C  4.622511 1.12366 1.119328
C  -3.548786 1.522119 -0.047304
C  -1.755936 3.177519 0.097047
C  -3.133168 2.872171 -0.021724
H  0.153329 -0.316028 1.422229
H  2.36233 -0.653317 0.995201
H  2.187876 -1.667026 -0.48365
H  4.270728 -0.575063 -0.873172
H  3.078123 0.387148 -1.79807
H  -0.399076 -1.901751 -2.22418
H  -2.922586 -0.562464 0.006197
H  0.266547 2.364147 0.270081
H  -1.41372 -4.447615 -1.712411
H  -1.746265 -3.377688 2.7292
H  -0.266414 -2.371814 2.858861
H  -1.865871 -1.588848 2.603187
H  4.534384 3.323048 -0.391075
H  3.649641 2.6174 -1.77392
H  5.334584 2.085752 -1.419402
H  4.782259 2.069719 1.666817
H  5.627452 0.695924 0.864618
H  4.121858 0.419999 1.808094
H  -4.611971 1.276617 -0.149053
H  -1.426154 4.222761 0.107844
H  -3.872101 3.677873 -0.099174
