program: Gaussian 09
title: 000010641
version: EM64L-G09RevD.01
frameworkgroup: C1[X(C20H23N)]
method: RPBEPBE
basis: SDD
operation: Freq
keyword: #pfreq=noraman
keyword: PBEPBE/SDD
title: #p freq=noraman PBEPBE/SDD
converged: YES YES NO NO
title: Mulliken charges:
elementType: N C C C C C C C C C C C C C C C C C C C C H H H H H H H H H H H H H H H H H H H H H H H
charge: -0.087687 -0.438897 -0.379214 -0.424242 0.429814 0.383371 -0.363166 0.353067 0.352339 -0.461494 -0.442876 -0.412612 -0.411868 -0.424558 -0.431066 -0.241320 -0.244372 -0.257164 -0.256101 -0.606818 -0.630884 0.183252 0.197985 0.261584 0.231956 0.189254 0.183892 0.203802 0.235112 0.234417 0.208821 0.207567 0.235577 0.237904 0.226244 0.226717 0.228288 0.228207 0.223606 0.183709 0.219175 0.215639 0.184901 0.248141
chargesum: 0.00000
title: Mulliken charges with hydrogens summed into heavy atoms:
elementType: N C C C C C C C C C C C C C C C C C C C C
charge: -0.087687 -0.255645 0.080355 -0.003033 0.429814 0.383371 0.024528 0.353067 0.352339 -0.226383 -0.208458 -0.203791 -0.204301 -0.188981 -0.193163 -0.015076 -0.017655 -0.028876 -0.027894 0.019672 0.017796
polarizability: 2.32113394e+02 -6.46391172e+01 2.35707593e+02 -7.03659509e+00 -5.12658930e+00 2.10803599e+02
1716.lowfreq: -4.6051 -3.7829 -0.0006 -0.0005 -0.0002 5.1175 13.9094 31.6224 46.6149
frequency: 12.8553 31.5477 46.6101 50.4151 70.2749 100.6657 108.9788 154.7519 193.7276 205.4967 215.9193 234.5677 254.1668 279.0578 286.6716 304.9583 323.6596 333.4710 344.2520 389.4203 394.2764 422.2130 461.6006 474.6084 519.7820 521.0875 535.7927 587.7447 589.1348 614.4171 641.3573 693.4660 707.7345 727.5934 735.2309 750.4173 766.5929 769.5542 787.6303 809.8958 823.4337 844.0874 868.6171 883.0234 890.9734 906.4687 949.0277 951.7029 955.7074 978.5644 985.1133 988.5674 1011.9980 1033.8273 1037.3076 1046.7335 1054.9942 1064.2622 1087.4168 1093.4756 1106.4258 1111.3442 1134.3306 1137.7034 1162.1336 1173.1684 1174.0378 1193.8970 1207.0404 1214.0240 1221.1669 1237.6661 1246.9406 1256.4870 1264.4819 1284.7182 1293.7586 1302.2978 1322.3392 1347.2239 1356.8137 1366.1831 1384.2951 1386.3714 1415.9094 1417.2079 1423.6538 1438.9018 1452.8129 1456.4578 1460.6379 1471.1965 1473.8232 1475.3408 1482.5569 1484.8603 1489.7432 1490.6824 1568.8578 1576.2638 1603.6463 1605.3379 1634.0104 2816.9237 2836.8300 2853.7170 2970.2026 2972.9778 2985.5803 2998.6331 3014.0882 3025.9750 3036.5113 3073.8073 3078.2867 3081.0970 3083.0828 3108.2817 3113.9071 3114.7757 3119.1071 3119.9110 3138.0576 3138.5035 3159.9050 3160.4243
redmass: 3.6857 3.3800 3.0032 4.7835 3.5661 3.8754 3.4548 2.9710 2.9274 2.0619 2.0099 1.3240 2.1041 2.4464 3.4562 2.1602 4.5353 4.4605 2.1277 3.3665 2.9721 2.2056 2.8906 4.4267 3.6647 4.9551 3.6427 3.1796 3.2078 4.4594 4.7588 3.8051 4.8396 1.6201 2.0051 2.2451 1.8144 1.9172 2.5631 1.5911 2.3159 3.0515 1.6642 1.7334 2.0010 2.8666 1.4179 1.4153 2.3457 1.3273 1.3379 1.3302 2.9763 1.6250 2.0145 2.2862 2.5905 2.1690 1.4893 1.7217 2.2789 1.8903 1.5123 1.4921 2.1021 1.1298 1.0798 1.9807 1.6631 1.7161 2.3226 1.4807 1.4098 2.0181 1.7348 1.4813 1.2506 1.2911 1.2568 1.6980 1.5496 1.3622 4.9968 3.2972 1.1434 1.7464 2.1575 1.1644 2.0394 1.0621 1.0612 1.0980 1.0553 1.0841 2.4495 1.0649 2.7378 1.0716 7.0288 6.3945 6.0816 6.1176 7.1514 1.0701 1.0576 1.0580 1.0812 1.0665 1.0674 1.0870 1.0711 1.0719 1.0930 1.1010 1.0964 1.0835 1.1003 1.0940 1.0862 1.0863 1.0889 1.0889 1.0929 1.0929 1.1006 1.1006
irintensity: 0.0083 0.1549 0.6126 0.4606 0.1073 0.1090 0.3509 0.0486 0.5842 0.0590 0.3248 0.5492 0.7754 0.9801 2.9290 6.9740 1.3236 0.3321 5.9411 0.7346 0.5306 1.3005 25.0036 5.4073 0.1187 2.1355 1.4545 8.7412 0.1445 3.9544 4.6321 1.8728 0.8497 14.4736 8.9109 5.5920 47.0971 17.8884 29.9820 75.7354 5.5942 2.6374 0.3344 2.9232 8.3013 1.5248 1.0026 4.9816 10.9968 1.4118 0.0876 0.3272 8.3087 17.1772 0.1258 9.1281 9.2253 3.5694 12.1830 15.8561 3.2854 5.6708 5.7486 1.9259 5.3771 0.1040 0.0225 0.5107 20.9053 4.3941 4.2453 0.2711 1.5412 7.0648 6.1921 11.5098 2.3839 2.4324 5.3123 1.1624 1.2995 11.4706 1.0125 0.8214 2.1113 0.0725 10.5867 3.8303 7.7780 2.7184 14.1120 7.5984 11.3768 9.5766 4.0252 9.8424 20.3124 14.1907 0.4218 1.3477 3.0257 0.1484 0.8481 73.3913 76.3845 279.5067 6.7926 57.4262 19.1338 15.3836 39.9645 29.3007 40.9368 25.7961 28.5771 0.3193 37.7537 23.7544 1.0048 26.1753 0.9015 5.4707 14.3138 42.7067 64.7715 17.4697
temp: 298.150 k
press: 1.00000 atm
elementType: 7 6 6 6 6 6 6 6 6 6 6 6 6 6 6 6 6 6 6 6 6 1 1 1 1 1 1 1 1 1 1 1 1 1 1 1 1 1 1 1 1 1 1 1
symmnumber: 1
zpe: 982219.2 jmol-1
zpe.correction: 0.374108 hartree
zpe.thermalcorrener: 0.393195 hartree
zpe.thermalcorrenthalpy: 0.394139 hartree
zpe.thermalcorrgfe: 0.325249 hartree
zpe.sumelectzpe: -829.136265 hartree
zpe.sumelectthermal: -829.117178 hartree
zpe.sumelectthermalent: -829.116233 hartree
zpe.sumelectthermalfe: -829.185124 hartree
dipole: -0.9875 -0.0880 -0.3883
dipole: 1.0648
quadrupole: -121.4066 -122.4825 -114.0744
quadrupole: -5.6697 -1.0986 0.4667
quadrupole: -2.0854 -3.1613 5.2467 -5.6697 -1.0986 0.4667
hfenergy: -829.5103728 hartree
pointgroup: C01[X(C20H23N1)]
dipole: 0.3924063 -0.0452765 0.1394757 debye
polarizability: 234.3142196|64.9266642|232.9115652|-6.4603526|3.6094966|211.3988018 unknown
InChI: InChI=1S/C20H23N/c1-21(2)15-7-12-20-18-10-5-3-8-16(18)13-14-17-9-4-6-11-19(17)20/h3-6,8-11,13-14,20H,7,12,15H2,1-2H3
charge 0 multiplicity 1
44 atoms
N  3.478702 -1.792426 -0.431853
C  -0.420752 -0.090211 1.040435
C  0.713599 -1.115707 0.704114
C  2.048018 -0.793399 1.40873
C  -1.781112 -0.592035 0.55406
C  -0.080177 1.324641 0.566103
C  3.181504 -1.768629 1.021906
C  -2.091334 -0.745248 -0.836462
C  0.050919 1.656939 -0.822222
C  -2.73049 -1.019448 1.514687
C  0.209989 2.318646 1.533309
C  -1.244773 -0.25722 -1.933605
C  -0.327638 0.765795 -1.927666
C  -3.315297 -1.384668 -1.197662
C  0.543112 2.950541 -1.172574
C  -3.951155 -1.623082 1.141403
C  0.662125 3.606224 1.170307
C  -4.239397 -1.818877 -0.229612
C  0.84521 3.918755 -0.197196
C  4.35899 -2.921554 -0.791507
C  3.998103 -0.507961 -0.942263
H  -0.477703 -0.045367 2.147398
H  0.367681 -2.120939 1.019237
H  0.884032 -1.170072 -0.384242
H  2.350895 0.248258 1.190379
H  1.916876 -0.84944 2.509789
H  4.098509 -1.513028 1.618871
H  2.885282 -2.796213 1.312857
H  -2.494565 -0.894677 2.578756
H  0.099752 2.066662 2.595273
H  -1.451055 -0.718404 -2.910231
H  0.114223 1.027825 -2.899888
H  -3.54384 -1.516146 -2.262595
H  0.658626 3.197179 -2.235347
H  -4.660149 -1.951667 1.909416
H  0.886412 4.349018 1.943874
H  -5.174559 -2.299754 -0.536774
H  1.211609 4.906961 -0.496193
H  3.894465 -3.872281 -0.473365
H  5.376259 -2.861585 -0.323648
H  4.492524 -2.956056 -1.887976
H  4.189001 -0.595623 -2.026931
H  4.95262 -0.19193 -0.446144
H  3.254961 0.294403 -0.796751
