program: Gaussian 09
title: 000132403
version: EM64L-G09RevD.01
frameworkgroup: C1[X(C19H25F3N2O)]
method: RPBEPBE
basis: SDD
operation: Freq
keyword: #p
keyword: freq=noraman
keyword: PBEPBE/SDD
title: #p freq=noraman PBEPBE/SDD
converged: NO YES NO NO
title: Mulliken charges:
elementType: F F F O N N C C C C C C C C C C C C C C C C C C C H H H H H H H H H H H H H H H H H H H H H H H H H
charge: -0.167116 -0.165080 -0.168227 -0.282888 -0.148076 -0.126192 -0.009742 -0.069993 -0.458992 -0.444022 -0.391408 -0.394349 -0.381375 -0.368805 -0.443959 -0.461694 -0.675024 0.104390 0.272233 -0.313563 -0.370038 -0.362450 -0.339942 0.299787 0.258081 0.197035 0.269360 0.203022 0.208011 0.226724 0.185814 0.189680 0.202651 0.205221 0.202905 0.185452 0.214271 0.257698 0.188410 0.214953 0.223641 0.222889 0.210433 0.251344 0.255600 0.233151 0.262248 0.270804 0.263642 0.263486
chargesum: 0.00000
title: Mulliken charges with hydrogens summed into heavy atoms:
elementType: F F F O N N C C C C C C C C C C C C C C C C C C C
charge: -0.167116 -0.165080 -0.168227 -0.282888 -0.148076 -0.126192 0.187293 0.199367 -0.047958 -0.031484 0.000923 0.013777 0.018348 0.077304 -0.005366 -0.028372 0.065070 0.104390 0.272233 -0.051315 -0.099234 -0.098808 -0.076456 0.299787 0.258081
polarizability: 2.85504310e+02 -9.69405203e+00 2.08623882e+02 5.75379013e+00 1.44171277e+01 1.67257401e+02
1716.lowfreq: -22.6675 -13.7820 -5.6920 -1.0934 -0.0003 0.0003 0.0004 6.8922 17.1451
frequency: -21.8197 -1.6404 16.7939 22.0642 38.6538 55.7791 59.4076 76.5939 93.3473 105.5241 126.7766 147.4655 156.8100 165.0944 192.9368 220.0435 221.3142 237.3630 242.4523 287.7152 296.8946 306.7918 319.6739 359.6079 368.4214 403.9168 404.4026 420.9961 435.8491 440.4144 466.9593 481.1204 492.8280 514.7453 556.8685 609.2402 617.1921 622.7151 627.6052 679.5411 684.0380 697.1312 750.2585 755.7173 763.7076 785.5529 829.1578 841.7441 852.1155 858.2541 860.5797 870.4558 879.7684 896.5060 924.0998 956.7278 962.8691 971.7453 972.3396 981.9562 986.7835 987.3031 996.2103 1022.5922 1028.4735 1042.2988 1055.7155 1057.3488 1061.9862 1092.9087 1099.8635 1101.5318 1109.2742 1111.8273 1129.6791 1135.6212 1153.6039 1183.9597 1186.7804 1196.4446 1198.9428 1203.9703 1215.9836 1225.1161 1242.4115 1251.7266 1256.7728 1282.2105 1284.3377 1289.8106 1295.2542 1308.9553 1310.4854 1315.8849 1321.9968 1332.0720 1338.8118 1342.2681 1350.3590 1356.6684 1372.3844 1374.2666 1402.4161 1406.4998 1433.9530 1461.1836 1462.9313 1465.5856 1467.4422 1472.2201 1475.9767 1479.6704 1487.0866 1494.7714 1499.9446 1505.5347 1542.3211 1580.6744 1621.6662 2863.9056 2875.0913 2940.6385 2964.5759 2965.7302 2976.3340 2976.7612 2977.5161 3005.9880 3011.2360 3018.6428 3023.9659 3030.1841 3035.6388 3041.7384 3049.6995 3051.7838 3054.3261 3065.3309 3089.4788 3116.0187 3140.3560 3154.9088 3166.7022 3174.6209
redmass: 1.8249 12.8810 4.3673 6.0930 4.7813 3.5028 5.1417 2.8515 3.1066 3.7266 4.9446 5.6474 3.1026 4.6693 1.3578 3.7647 2.3185 2.6255 5.0004 4.0085 6.2536 2.9264 1.8319 8.8031 5.2348 4.0135 2.9004 6.6837 3.0963 3.2223 4.2080 2.9451 3.4169 10.2851 4.3019 3.7989 7.4722 2.6019 5.9982 3.1964 6.8344 5.8840 4.7515 1.5733 4.1354 1.8825 1.9420 1.8069 2.0020 1.2865 1.6621 1.9701 1.8232 2.7558 2.0898 2.4330 1.8786 2.1135 1.6575 2.8736 2.6537 1.4070 6.7267 8.2330 2.9066 1.8587 1.5290 1.8114 2.3879 1.8933 2.0282 1.9475 1.5321 1.8986 1.4314 2.2458 2.4374 2.2126 1.3079 1.2115 1.4536 1.5454 2.8021 1.4128 1.4146 1.4728 1.4042 4.2572 1.2248 1.3419 1.3115 1.2662 1.2768 1.4556 1.3823 1.3924 1.3987 1.4284 1.4839 1.5715 3.7979 1.6663 1.7688 2.8711 1.4967 1.0875 1.0894 1.0841 1.0799 1.0660 1.0942 1.0873 1.0810 1.2080 1.1066 2.2647 8.0052 7.5254 6.2714 1.0704 1.0702 1.0823 1.0636 1.0642 1.0619 1.0427 1.0554 1.0775 1.0682 1.0831 1.0670 1.0954 1.1003 1.0996 1.0997 1.0916 1.1004 1.1041 1.1054 1.0974 1.0897 1.0886 1.0959 1.0977
irintensity: 0.0871 0.0283 0.8380 0.5264 0.9418 0.3068 2.6197 1.1425 1.2122 0.4606 3.5972 2.8062 1.6784 0.3789 0.5349 0.2801 0.7437 0.1995 1.0739 9.3936 0.5239 5.5617 1.6624 1.9421 17.6133 1.5388 1.3809 21.4404 0.5791 6.8306 7.2328 6.8807 5.5327 0.2602 6.9531 7.9530 4.9428 0.7965 2.1928 0.3907 8.1109 16.0560 5.6837 0.3464 10.0488 0.5087 3.3472 19.8526 22.6508 3.9059 52.3539 13.8865 28.6059 4.0056 1.5097 12.0286 1.5308 100.1475 3.8118 120.9554 8.2940 1.8663 164.7570 191.3328 5.2455 12.1529 7.9273 137.9649 4.4752 3.8046 3.4473 2.1345 3.8693 5.8424 1.9391 31.3112 18.6750 16.8294 8.2677 6.3525 4.0658 2.0758 4.4158 8.5388 12.1982 16.0999 6.4682 433.3954 8.6732 2.5203 3.7721 0.1028 0.4825 42.3381 2.9693 2.0545 2.9791 1.9244 11.1628 38.9705 0.7481 7.6108 35.0421 25.8099 16.4664 5.4242 3.6439 1.9246 5.5096 17.2807 16.4787 8.1781 2.2690 10.3414 2.3261 27.4957 236.7773 13.2031 11.7841 63.2856 141.9965 16.8439 27.6912 33.1094 23.7524 40.9914 47.5947 14.7867 55.7729 49.6812 59.6326 55.5154 43.2738 25.6887 37.5320 34.3460 32.6291 4.5289 83.0693 17.3451 2.8104 0.5747 3.2252 1.5461
temp: 298.150 k
press: 1.00000 atm
elementType: 9 9 9 8 7 7 6 6 6 6 6 6 6 6 6 6 6 6 6 6 6 6 6 6 6 1 1 1 1 1 1 1 1 1 1 1 1 1 1 1 1 1 1 1 1 1 1 1 1 1
symmnumber: 1
zpe: 1078006.4 jmol-1
zpe.correction: 0.410591 hartree
zpe.thermalcorrener: 0.433070 hartree
zpe.thermalcorrenthalpy: 0.434015 hartree
zpe.thermalcorrgfe: 0.357115 hartree
zpe.sumelectzpe: -1221.383520 hartree
zpe.sumelectthermal: -1221.361041 hartree
zpe.sumelectthermalent: -1221.360097 hartree
zpe.sumelectthermalfe: -1221.436997 hartree
dipole: 5.7247 0.6102 2.7799
dipole: 6.3931
quadrupole: -164.5725 -141.6486 -152.7477
quadrupole: 4.4872 4.9378 -2.6214
quadrupole: -11.5829 11.3410 0.2419 4.4872 4.9378 -2.6214
hfenergy: -1221.7941112 hartree
pointgroup: C01 [X(C19H25F3N2O1)]
dipole: -2.2180669 0.1285537 1.1790513 debye
polarizability: 281.6412472|-19.5546574|208.682805|-10.1211512|-17.0226527|171.0615413 unknown
InChI: InChI=1S/C19H25F3N2O/c1-23(16-6-2-3-7-17(16)24-12-4-5-13-24)18(25)14-8-10-15(11-9-14)19(20,21)22/h8-11,16-17H,2-7,12-13H2,1H3
charge 0 multiplicity 1
50 atoms
F  5.478324 -2.218114 0.219036
F  6.231269 -0.454806 -1.001672
F  5.946268 -0.248668 1.234225
O  -0.425402 1.315536 -1.96682
N  -2.902393 -1.086866 0.371547
N  -1.02721 1.087462 0.278167
C  -3.4028 0.289753 0.586848
C  -2.452865 1.336654 -0.065886
C  -4.859036 0.569178 0.095562
C  -2.883379 2.784021 0.283774
C  -5.307295 2.007431 0.447742
C  -4.341681 3.052391 -0.156774
C  -3.543811 -2.161315 1.171218
C  -2.812405 -1.609038 -1.016747
C  -2.958283 -3.478347 0.578422
C  -2.323509 -3.059415 -0.790605
C  -0.689664 0.931704 1.70212
C  -0.113449 1.021723 -0.761144
C  1.296139 0.558938 -0.467228
C  1.55809 -0.654493 0.219139
C  2.376013 1.285714 -1.028631
C  2.879771 -1.118442 0.370804
C  3.700665 0.839528 -0.863908
C  3.951177 -0.363713 -0.160601
C  5.364866 -0.815553 0.0588
H  -3.397743 0.452395 1.687451
H  -2.507132 1.234275 -1.165977
H  -5.551134 -0.166196 0.549268
H  -4.910668 0.42873 -1.003044
H  -2.193155 3.489455 -0.214805
H  -2.79718 2.954763 1.377063
H  -5.332972 2.12483 1.551429
H  -6.338415 2.182955 0.085143
H  -4.402217 3.009917 -1.263252
H  -4.642922 4.074846 0.14128
H  -4.656711 -2.167768 1.06623
H  -3.313491 -2.029889 2.245414
H  -2.113267 -1.010153 -1.624826
H  -3.802089 -1.616195 -1.537093
H  -3.753008 -4.233195 0.446152
H  -2.195339 -3.91459 1.245555
H  -1.221608 -3.073108 -0.722795
H  -2.619584 -3.727643 -1.617727
H  0.39249 1.050449 1.858099
H  -1.00476 -0.061232 2.073281
H  -1.203986 1.711835 2.292236
H  0.724698 -1.244212 0.616073
H  2.161763 2.190133 -1.605797
H  3.078385 -2.062464 0.887083
H  4.532648 1.407202 -1.29163
