program: Gaussian 09
title: 000132333
version: EM64L-G09RevD.01
frameworkgroup: C1[X(C6H16FN2O2P)]
method: RPBEPBE
basis: SDD
operation: Freq
keyword: #p
keyword: freq=noraman
keyword: PBEPBE/SDD
title: #p freq=noraman PBEPBE/SDD
converged: YES YES NO NO
title: Mulliken charges:
elementType: P F O O N N C C C C C C H H H H H H H H H H H H H H H H
charge: 1.424913 -0.399182 -0.525278 -0.564177 -0.094492 -0.514643 -0.348104 -0.260974 -0.612048 -0.613199 -0.564600 -0.562329 0.191476 0.235518 0.253458 0.224844 0.232056 0.191813 0.224062 0.229160 0.190679 0.218995 0.245370 0.239800 0.233893 0.261323 0.230686 0.230980
chargesum: 0.00000
title: Mulliken charges with hydrogens summed into heavy atoms:
elementType: P F O O N N C C C C C C
charge: 1.424913 -0.399182 -0.525278 -0.564177 -0.094492 -0.514643 0.078890 0.217328 0.035883 0.025634 0.154462 0.160660
polarizability: 1.33109695e+02 -9.19842579e-01 1.05601415e+02 -2.31940531e+00 3.26727312e+00 9.20815996e+01
1716.lowfreq: -22.3190 -12.1777 -1.4599 -0.0012 -0.0007 0.0008 7.3971 23.7304 38.4315
frequency: -19.8886 23.6125 38.3787 55.0270 82.4438 97.8574 137.4995 167.7707 174.4678 194.1026 202.1248 212.0870 222.8788 231.3403 274.4502 282.8045 317.3118 344.2917 380.9202 387.9377 397.4124 451.3076 456.2814 585.6287 682.8504 727.3454 803.6342 828.6280 936.6796 955.7302 1032.5144 1035.5701 1058.9555 1062.9468 1072.8322 1084.4060 1091.3095 1091.8136 1131.6720 1136.2793 1166.6017 1186.0875 1240.1829 1264.4851 1267.9886 1287.5859 1326.2595 1380.3170 1420.0949 1425.9628 1443.6286 1444.9537 1461.1257 1463.3305 1467.1993 1471.7930 1475.7611 1477.8588 1479.3506 1482.1460 1485.4962 1494.6456 2852.9370 2862.0298 2879.6451 2954.2284 2957.8377 3002.9994 3023.5141 3028.5579 3041.3362 3044.6439 3053.4610 3080.9580 3085.3214 3091.2113 3094.5171 3115.8321
redmass: 2.6769 4.0063 2.7292 3.6409 2.6793 2.4055 2.4541 3.1243 1.0506 3.1350 1.8551 1.2354 2.7974 1.3282 3.9113 5.6734 3.5603 3.0584 3.6824 4.1212 3.6129 3.0523 3.8367 6.4352 11.9160 10.2713 1.2012 3.8249 9.5856 3.0728 2.3473 1.5325 1.4324 1.6434 5.8704 2.0961 1.5960 1.2600 1.3587 1.4351 1.3731 5.0246 1.8062 2.1123 2.5138 1.2300 1.3246 1.3688 1.1410 1.1242 1.1621 1.1416 1.0472 1.0617 1.0597 1.0595 1.0554 1.0479 1.0496 1.0806 1.0553 1.0519 1.0570 1.0605 1.0661 1.0382 1.0395 1.0599 1.0735 1.0722 1.0972 1.0980 1.0884 1.1011 1.1006 1.1002 1.1063 1.0980
irintensity: 0.5860 1.5863 1.1851 1.1234 1.5919 2.6548 0.6609 2.9853 0.1353 1.0073 1.4384 1.1358 9.7898 0.4248 6.6589 14.6664 17.6221 22.0298 8.1322 21.5220 13.1046 16.4142 9.8690 12.8132 113.9218 127.9713 4.9395 11.3185 270.5514 121.3991 67.1271 16.1341 12.2042 10.2203 86.5757 61.9991 22.4471 1.9534 3.1553 1.6894 4.6835 42.1865 4.3409 13.2853 11.4568 3.7991 1.8818 1.1129 2.0331 10.4379 2.2925 1.5693 10.4868 5.1075 5.7595 16.1652 14.1354 29.1088 19.7997 25.0744 11.8167 9.0119 71.9530 105.0498 166.3793 41.8228 102.0777 18.4768 38.9725 50.8072 62.2347 1.9975 7.9516 15.3682 51.6561 20.8062 27.7565 5.8963
temp: 298.150 k
press: 1.00000 atm
elementType: 15 9 8 8 7 7 6 6 6 6 6 6 1 1 1 1 1 1 1 1 1 1 1 1 1 1 1 1
symmnumber: 1
zpe: 599526.4 jmol-1
zpe.correction: 0.228348 hartree
zpe.thermalcorrener: 0.244084 hartree
zpe.thermalcorrenthalpy: 0.245028 hartree
zpe.thermalcorrgfe: 0.184131 hartree
zpe.sumelectzpe: -938.207468 hartree
zpe.sumelectthermal: -938.191732 hartree
zpe.sumelectthermalent: -938.190787 hartree
zpe.sumelectthermalfe: -938.251685 hartree
dipole: -2.9938 5.4739 -0.3067
dipole: 6.2466
quadrupole: -78.8285 -82.3938 -84.7488
quadrupole: 12.6886 3.8708 -2.2952
quadrupole: 3.1619 -0.4034 -2.7585 12.6886 3.8708 -2.2952
hfenergy: -938.4358154 hartree
pointgroup: C01 [X(C6H16F1N2O2P1)]
dipole: -0.9911185 -2.241131 0.1867542 debye
polarizability: 132.8518144|3.2947156|106.0512255|0.8084068|3.1206256|91.8896692 unknown
InChI: InChI=1S/C6H16FN2O2P/c1-8(2)5-6-11-12(7,10)9(3)4/h5-6H2,1-4H3
charge 0 multiplicity 1
28 atoms
P  1.91877 0.936472 0.016711
F  1.921962 1.169764 -1.714419
O  0.267789 1.10253 0.438691
O  2.842123 1.969896 0.773396
N  -3.170924 -0.222697 -0.208715
N  2.201619 -0.777912 0.037117
C  -2.024558 0.356709 0.524756
C  -0.79132 0.443704 -0.385529
C  -4.47807 0.225771 0.313257
C  -3.101113 -1.691985 -0.341173
C  1.995235 -1.484626 1.322675
C  3.202861 -1.381361 -0.870794
H  -1.763839 -0.215787 1.449644
H  -2.283913 1.382507 0.840692
H  -1.000893 1.075563 -1.26444
H  -0.434168 -0.549825 -0.716864
H  -4.525565 1.328696 0.305648
H  -4.686369 -0.1251 1.355445
H  -5.285056 -0.153324 -0.33928
H  -3.928417 -2.044206 -0.982373
H  -3.173478 -2.224085 0.641889
H  -2.1553 -1.993877 -0.823575
H  1.204649 -0.985804 1.908961
H  2.919248 -1.524738 1.93527
H  1.667723 -2.518537 1.109035
H  3.253467 -0.810576 -1.810756
H  2.881575 -2.412139 -1.108924
H  4.213762 -1.421532 -0.415444
