program: Gaussian 09
title: 000132306
version: EM64L-G09RevD.01
frameworkgroup: C1[X(C23H24FNO4)]
method: RPBEPBE
basis: SDD
operation: Freq
keyword: #p
keyword: freq=noraman
keyword: PBEPBE/SDD
title: #p freq=noraman PBEPBE/SDD
converged: YES YES NO NO
title: Mulliken charges:
elementType: F O O O O N C C C C C C C C C C C C C C C C C C C C C C C H H H H H H H H H H H H H H H H H H H H H H H H
charge: -0.209383 -0.300243 -0.234949 -0.273663 -0.275435 -0.205873 0.225205 -0.448961 -0.494881 0.483159 -0.326793 -0.332610 -0.520856 -0.605490 0.382476 -0.536839 0.374989 -0.559308 -0.457523 0.488834 0.217183 0.375182 -0.640162 -0.373894 -0.333510 -0.275012 0.123731 -0.292838 -0.664427 0.221035 0.229118 0.222697 0.216089 0.215951 0.212422 0.195533 0.218825 0.287331 0.265844 0.226470 0.230923 0.209082 0.281299 0.223052 0.225047 0.239630 0.255105 0.255976 0.242222 0.251470 0.236773 0.292058 0.237939
chargesum: 0.00000
title: Mulliken charges with hydrogens summed into heavy atoms:
elementType: F O O O O N C C C C C C C C C C C C C C C C C C C C C C C
charge: -0.209383 -0.300243 -0.234949 -0.273663 -0.275435 -0.205873 0.225205 0.001192 -0.056094 0.483159 0.101580 0.081748 -0.233526 -0.339646 0.382476 0.129636 0.374989 -0.278008 -0.009425 0.488834 0.217183 0.375182 -0.400532 -0.118788 -0.077534 -0.032790 0.123731 -0.041368 0.102344
polarizability: 4.24279116e+02 1.52345404e+01 2.50142371e+02 4.42793634e+00 2.56149261e+01 1.81401776e+02
1716.lowfreq: -7.3575 -4.0210 -2.9694 -0.0009 -0.0004 0.0011 5.8194 16.7726 25.3415
frequency: 0.6440 16.1595 25.3302 29.0414 61.8426 73.0265 86.2131 95.2686 108.7624 116.2804 131.8097 149.0585 181.3054 184.1081 204.3127 214.5746 215.3067 229.2723 234.3076 247.9408 254.5462 274.7225 284.4173 305.8704 322.3486 351.8911 361.4110 379.1393 386.6527 396.6721 411.2560 433.8555 438.6012 474.1145 491.6184 503.2368 513.8016 518.0238 530.1401 537.4141 571.0172 575.1730 590.7148 614.2909 615.8259 647.0189 677.7136 692.8271 699.6473 731.1794 769.4747 780.3106 791.2919 796.1477 803.3456 823.8231 834.2902 840.6440 862.8559 873.2806 882.0593 887.1209 897.7903 909.6967 917.3610 945.2081 960.5799 962.5956 981.2180 984.5600 995.9928 1005.8429 1011.8240 1014.1939 1020.5461 1053.0515 1059.1246 1070.5133 1104.7242 1107.4208 1113.2034 1119.5980 1121.5092 1135.6572 1158.9585 1161.3589 1169.7958 1173.6797 1193.5141 1201.0229 1204.5186 1239.2938 1250.0752 1251.8311 1258.7948 1272.3646 1276.2485 1286.4891 1294.2250 1322.5744 1327.6952 1344.3276 1348.3143 1351.7036 1375.6843 1378.2338 1392.4743 1411.8595 1424.8376 1427.0702 1427.1274 1432.7866 1440.7764 1448.2740 1451.4296 1462.1786 1463.5042 1468.9255 1474.2480 1478.9977 1480.3891 1498.8230 1501.1196 1566.4676 1570.7452 1598.6841 1614.5783 1633.0773 1645.5701 2947.1997 2951.5349 2960.9267 2981.3936 2989.0722 2997.0022 3004.5338 3011.2574 3033.4561 3057.5220 3068.5374 3076.5215 3077.4332 3082.6444 3098.0514 3118.0594 3118.4540 3129.8923 3150.3173 3165.2003 3178.2974 3185.1124 3185.4215 3190.3382
redmass: 4.4714 5.4823 6.6012 4.5248 6.5939 5.0610 5.3385 5.5051 2.6643 3.4843 3.0743 1.9571 3.6794 2.5186 4.0421 1.2233 2.4571 5.4933 4.3745 4.0656 4.9643 2.6818 3.7795 4.1655 3.4468 3.2785 3.5770 2.9402 3.6332 3.2959 3.4109 3.2248 6.4619 4.9901 3.2426 6.5759 3.1869 3.8598 5.8445 3.9753 6.2146 3.3622 4.8172 4.5619 4.8977 2.8250 4.1717 4.1830 2.2939 5.5390 3.8025 5.2866 4.0657 1.6171 4.2538 1.6964 1.5437 1.5853 1.7420 2.5140 1.6056 2.4974 2.3057 2.5176 2.3538 3.4660 1.5171 2.3948 5.2968 1.3372 2.8880 3.6633 1.9091 2.2086 2.8058 3.9442 2.4578 5.1274 1.9108 1.7256 1.3569 2.0097 1.3163 1.8718 1.4114 1.4189 1.8270 1.8262 1.2595 1.4116 1.1805 1.4092 1.8215 1.4090 1.3231 2.4728 1.8592 2.4086 1.7222 1.4018 3.0586 1.4681 1.2126 1.7549 1.2575 1.7408 7.7397 4.0837 1.9376 1.2636 1.4159 1.3821 3.4285 1.0879 1.0802 1.5885 1.3659 1.1042 1.1238 1.2579 1.0656 1.0453 2.8885 7.3542 6.6214 6.9544 7.5485 6.7103 7.4862 1.0577 1.0321 1.0669 1.0642 1.0344 1.0599 1.0602 1.1041 1.1025 1.1002 1.1004 1.1024 1.0982 1.1021 1.0994 1.0922 1.0985 1.0903 1.0892 1.0901 1.0947 1.0917 1.0959 1.0935
irintensity: 0.5773 0.8568 0.6285 0.7165 1.0125 0.1962 4.2209 3.8192 2.4488 0.5410 2.1666 0.2918 2.8806 4.3065 4.5911 2.5969 5.6958 3.1161 0.1998 0.3852 2.0968 3.4013 7.5313 2.7972 2.1355 2.8142 2.2954 9.4647 6.5015 2.0425 4.7274 2.9369 11.2871 6.5381 4.3826 5.1584 3.1101 5.8205 5.1324 30.8120 5.8614 4.6003 0.8183 2.2547 0.4743 1.3127 6.1875 5.7338 16.0965 2.1267 2.1068 25.6477 14.5230 1.7744 16.3947 30.7398 45.3236 4.6908 39.4177 9.4050 4.8127 13.8191 23.1842 9.7155 13.3327 4.7132 1.7557 15.3547 10.3452 0.9940 18.6312 243.4619 8.0696 33.6528 71.5220 3.8486 14.7668 28.4230 126.6287 96.5655 4.8562 22.5013 0.2206 27.4462 12.1089 7.8011 20.4992 19.7557 34.2738 11.4375 6.2746 6.0939 23.7791 7.7796 3.0559 7.4070 49.7978 211.2025 3.3938 0.3249 1.8153 53.5575 8.9101 17.4343 0.8311 26.3420 35.7734 18.8395 79.5134 15.3301 47.9963 40.6200 17.1830 7.5529 4.7250 44.2883 13.1028 16.1236 77.0867 2.2356 2.4028 19.6446 23.5674 254.7874 22.3798 114.8278 277.3076 29.6559 280.4297 25.3015 56.3226 57.5101 53.1522 35.3743 22.0906 16.2224 22.6869 60.6883 35.2052 22.1077 23.1249 26.7565 42.1224 21.9101 7.0364 3.5027 13.4630 4.8648 9.3290 7.0888 0.5532 4.2523 0.1279
temp: 298.150 k
press: 1.00000 atm
elementType: 9 8 8 8 8 7 6 6 6 6 6 6 6 6 6 6 6 6 6 6 6 6 6 6 6 6 6 6 6 1 1 1 1 1 1 1 1 1 1 1 1 1 1 1 1 1 1 1 1 1 1 1 1
symmnumber: 1
zpe: 1109772.0 jmol-1
zpe.correction: 0.422690 hartree
zpe.thermalcorrener: 0.448979 hartree
zpe.thermalcorrenthalpy: 0.449923 hartree
zpe.thermalcorrgfe: 0.361319 hartree
zpe.sumelectzpe: -1344.210258 hartree
zpe.sumelectthermal: -1344.183969 hartree
zpe.sumelectthermalent: -1344.183024 hartree
zpe.sumelectthermalfe: -1344.271628 hartree
dipole: 1.9086 -1.2799 -0.6667
dipole: 2.3928
quadrupole: -229.4015 -174.3862 -163.5197
quadrupole: -9.3964 -17.3232 12.7142
quadrupole: -40.2990 14.7162 25.5828 -9.3964 -17.3232 12.7142
hfenergy: -1344.6329475 hartree
pointgroup: C01 [X(C23H24F1N1O4)]
dipole: 0.7504181 -0.3090147 -0.4771048 debye
polarizability: 424.3350486|9.6177148|210.6050593|12.2517896|42.5259732|220.8831552 unknown
InChI: InChI=1S/C23H24FNO4/c1-25-21-5-3-16(11-17(21)4-6-22(25)26)15-29-20-13-18(12-19(24)14-20)23(27-2)7-9-28-10-8-23/h3-6,11-14H,7-10,15H2,1-2H3
charge 0 multiplicity 1
53 atoms
F  3.583254 3.943409 1.622794
O  4.072874 -1.319433 -1.36117
O  6.95775 -2.356619 0.3752
O  -0.081732 1.089254 0.483258
O  -8.497537 -0.616195 -0.388184
N  -6.36755 -0.163808 0.513112
C  4.604383 -0.625593 -0.148437
C  4.601833 -1.749212 0.927224
C  6.067814 -0.161637 -0.372505
C  3.639986 0.504528 0.258205
C  5.590776 -2.874994 0.565303
C  6.977253 -1.360733 -0.707178
C  2.244925 0.252757 0.157617
C  4.091633 1.74968 0.751088
C  1.310971 1.238717 0.551839
C  4.021656 -0.512465 -2.584356
C  3.127286 2.701703 1.132396
C  1.749282 2.491073 1.052088
C  -0.60711 -0.221519 0.039306
C  -2.113809 -0.178623 0.147869
C  -4.967106 -0.161962 0.407632
C  -4.345363 -0.646969 -0.794306
C  -2.92727 -0.638711 -0.900187
C  -2.74082 0.30055 1.332675
C  -4.137211 0.315149 1.464127
C  -5.191952 -1.12336 -1.86572
C  -7.233991 -0.633703 -0.532662
C  -6.560947 -1.117656 -1.740324
C  -7.020091 0.335445 1.741336
H  3.579793 -2.162002 1.015784
H  4.876163 -1.304656 1.901523
H  6.443584 0.30045 0.558855
H  6.12791 0.603042 -1.170439
H  5.672965 -3.608132 1.384724
H  5.254396 -3.386196 -0.359616
H  6.657256 -1.837232 -1.658514
H  8.030586 -1.04617 -0.793478
H  1.928186 -0.706977 -0.260336
H  5.15106 1.997845 0.842863
H  3.44914 0.424471 -2.435301
H  3.507712 -1.142608 -3.32807
H  5.033696 -0.264459 -2.961814
H  1.030789 3.256207 1.354712
H  -0.176436 -1.009118 0.693641
H  -0.291416 -0.422423 -1.0038
H  -2.474245 -1.002393 -1.831536
H  -2.115944 0.684187 2.14578
H  -4.580346 0.697909 2.386518
H  -4.720456 -1.491561 -2.784693
H  -7.224421 -1.472247 -2.533285
H  -6.713591 -0.260925 2.618913
H  -8.105637 0.234542 1.59221
H  -6.771135 1.397574 1.913717
