program: Gaussian 09
title: 000132305
version: EM64L-G09RevD.01
frameworkgroup: C1[X(C20H25NO6)]
method: RPBEPBE
basis: SDD
operation: Freq
keyword: #p
keyword: freq=noraman
keyword: PBEPBE/SDD
title: #p freq=noraman PBEPBE/SDD
converged: YES YES NO NO
title: Mulliken charges:
elementType: O O O O O O N C C C C C C C C C C C C C C C C C C C C H H H H H H H H H H H H H H H H H H H H H H H H H
charge: -0.436346 -0.277407 -0.287528 -0.249419 -0.273673 -0.197791 -0.321480 -0.101274 -0.402422 -0.340626 -0.378254 -0.300834 0.383991 0.359914 -0.391586 -0.317748 -0.350183 -0.384203 0.344075 -0.311210 -0.382900 -0.222448 -0.198057 -0.258621 -0.366060 0.214332 -0.496075 0.196322 0.238084 0.221256 0.294747 0.209769 0.232462 0.202154 0.204876 0.201744 0.218730 0.336541 0.251159 0.250344 0.247631 0.252366 0.246176 0.254842 0.222830 0.226940 0.227378 0.241265 0.241123 0.235892 0.244368 0.244836
chargesum: 0.00000
title: Mulliken charges with hydrogens summed into heavy atoms:
elementType: O O O O O O N C C C C C C C C C C C C C C C C C C C C
charge: -0.099805 -0.277407 -0.287528 -0.249419 -0.273673 -0.197791 -0.026732 0.095049 0.056918 0.101605 0.028775 0.119639 0.383991 0.359914 -0.140426 -0.067404 -0.102552 -0.131837 0.344075 -0.065034 -0.128058 0.000382 0.028883 -0.031244 0.116327 0.214332 0.229021
polarizability: 2.87833754e+02 5.31410103e+01 2.60570545e+02 -1.08354397e+01 1.95282446e+01 1.86079973e+02
1716.lowfreq: -2.0425 -0.0011 -0.0010 -0.0007 2.8053 4.2536 8.1247 11.6573 14.0636
frequency: 7.9073 11.3818 14.0319 21.1866 27.8301 32.2827 37.0914 58.4937 67.7399 84.4041 89.1032 94.1425 113.3570 116.6911 138.3567 147.4228 158.7777 177.8129 180.2646 191.4289 219.6112 225.0026 242.4660 245.0988 276.8757 309.4204 322.5565 357.3565 378.0619 402.2968 406.0427 412.6648 417.3625 453.2721 475.8313 502.1023 505.3203 514.4815 519.5302 566.1623 577.5292 609.5482 630.9976 641.5448 664.9142 692.3148 710.3736 727.8248 757.8722 769.8215 799.7276 800.2794 802.9138 821.7462 822.7495 830.7496 867.4051 885.4020 889.1306 911.6355 923.2375 925.8504 943.2657 948.8556 960.2623 962.3236 981.7858 983.0010 996.5856 1005.2638 1010.7730 1022.8809 1032.4602 1037.8619 1045.2882 1082.5634 1084.3550 1100.2813 1114.3813 1118.2298 1123.4522 1131.3507 1149.5841 1155.6395 1166.7880 1173.8155 1178.6322 1192.0763 1201.7142 1202.7275 1208.3937 1216.6054 1219.6206 1240.1841 1243.4288 1286.6787 1303.7297 1312.0624 1317.1300 1343.4598 1354.0623 1361.0933 1366.3827 1373.7314 1385.1437 1389.5272 1401.6897 1424.1312 1424.8116 1443.1155 1453.3516 1454.0035 1456.5682 1461.5282 1465.0713 1468.4163 1470.0228 1481.2783 1485.1977 1498.5194 1585.9966 1591.2603 1612.2923 1629.7844 1686.6913 2888.7117 2937.8450 2951.7894 2954.4753 2959.5410 2961.0520 3005.8717 3008.2391 3011.2741 3012.3025 3030.7423 3048.8183 3108.0635 3127.4631 3136.5914 3150.7870 3151.7361 3155.2363 3155.5467 3164.3337 3170.6389 3172.7458 3176.1153 3436.8373 3564.1790
redmass: 6.3724 5.3049 6.6545 4.2888 4.4657 4.9102 5.2317 5.4154 4.9200 3.9459 1.1886 3.0886 3.2237 4.0688 4.6032 2.9650 3.9998 4.1975 5.2597 3.6415 3.2161 2.2725 3.0062 1.8992 2.8559 3.1846 4.3581 7.1348 4.0381 4.6514 4.9288 2.9854 3.0639 2.8694 5.1155 3.2086 3.8063 2.3866 4.3165 3.2822 4.0566 6.4368 6.9535 4.0811 4.8065 2.0737 3.6685 4.5411 1.6413 1.4546 2.7367 3.0645 1.9220 1.6232 1.4427 2.4574 5.4086 2.0297 1.4664 2.4893 2.7310 1.3686 1.3476 6.5360 2.0637 1.7094 1.3004 5.6451 2.7133 1.8622 2.5761 2.0641 2.2208 6.1175 2.3089 1.5442 1.9156 1.9795 1.2617 1.4159 1.8049 4.0455 1.4295 2.3546 1.0861 1.1876 1.1800 1.3607 1.1541 2.4775 1.2880 1.2809 2.3618 1.6510 2.3670 1.2383 1.2910 1.3126 1.2597 1.4022 1.9844 1.5346 1.3435 1.5619 2.7061 4.6478 1.6174 2.0061 1.6208 2.3325 1.1459 1.0496 1.2046 1.1056 1.0507 1.0910 1.2177 1.4407 1.2798 2.2547 7.1743 6.3999 6.2213 6.7321 10.1211 1.0703 1.0685 1.0680 1.0552 1.0700 1.0558 1.0296 1.1036 1.1028 1.0890 1.1077 1.0964 1.1048 1.0847 1.0891 1.0873 1.1047 1.0927 1.0875 1.0951 1.0963 1.1003 1.0967 1.0736 1.0662
irintensity: 0.0709 0.7979 0.6903 0.0804 1.1966 0.0923 0.2849 0.1222 2.3364 4.4177 0.5056 5.0166 1.2304 1.1637 0.5654 4.2360 23.4387 4.0443 0.7222 4.5311 21.1544 53.8202 44.4123 82.7143 8.3489 4.8168 12.3424 0.0910 8.4843 1.3399 0.4276 0.1560 0.4807 0.3908 1.4808 8.1133 6.5556 17.0675 6.4355 4.7102 2.5214 0.8042 0.0465 5.4577 3.8059 34.1411 0.0133 45.6007 92.3729 87.0424 4.2528 11.9425 2.6972 88.4854 16.7922 4.2393 19.2493 3.5780 7.4179 29.2672 71.6952 0.0928 0.9524 5.0334 24.6761 18.5854 1.4117 1.4665 4.0352 0.4756 31.1607 21.5174 120.7795 154.5435 20.1126 11.1696 4.7976 8.6813 0.0429 23.9208 39.0622 497.3240 0.6131 62.3108 9.1229 7.3170 38.1484 25.7239 37.1116 281.9595 62.4054 55.5058 169.6201 3.0430 0.6757 6.7318 0.1061 3.0191 2.9087 10.8590 15.4853 2.6933 31.0103 2.3393 7.7116 7.0427 19.9775 13.8497 7.1214 3.2348 156.6334 14.7080 81.3413 24.4488 14.5661 18.4956 62.1731 53.2324 6.3122 253.1034 0.2141 21.3254 71.7861 0.2145 172.5312 89.1425 7.7378 42.1798 51.5002 97.3572 35.7754 35.2754 19.9666 46.1994 45.3674 48.2948 46.3128 25.9620 2.1881 12.7781 17.9595 14.2668 29.8307 9.8745 20.1166 10.6731 4.3504 1.9131 3.2207 4.3455
temp: 298.150 k
press: 1.00000 atm
elementType: 8 8 8 8 8 8 7 6 6 6 6 6 6 6 6 6 6 6 6 6 6 6 6 6 6 6 6 1 1 1 1 1 1 1 1 1 1 1 1 1 1 1 1 1 1 1 1 1 1 1 1 1
symmnumber: 1
zpe: 1097854.2 jmol-1
zpe.correction: 0.418151 hartree
zpe.thermalcorrener: 0.446084 hartree
zpe.thermalcorrenthalpy: 0.447028 hartree
zpe.thermalcorrgfe: 0.352253 hartree
zpe.sumelectzpe: -1281.120622 hartree
zpe.sumelectthermal: -1281.092689 hartree
zpe.sumelectthermalent: -1281.091745 hartree
zpe.sumelectthermalfe: -1281.186520 hartree
dipole: 0.1866 1.9401 -1.0430
dipole: 2.2105
quadrupole: -155.3022 -143.8278 -153.7818
quadrupole: 22.8315 22.8448 0.1229
quadrupole: -4.3316 7.1428 -2.8112 22.8315 22.8448 0.1229
hfenergy: -1281.5387728 hartree
pointgroup: C01 [X(C20H25N1O6)]
dipole: -0.1174034 0.7447668 0.4334717 debye
polarizability: 293.1825313|-50.9213863|256.8777374|-9.6295548|-18.5832432|184.4240026 unknown
InChI: InChI=1S/C20H25NO6/c1-24-20(23)15-27-19-9-7-18(8-10-19)25-12-11-21-13-16(22)14-26-17-5-3-2-4-6-17/h2-10,16,21-22H,11-15H2,1H3
charge 0 multiplicity 1
52 atoms
O  6.838766 -0.74676 0.406426
O  4.400373 1.01167 -0.0049
O  0.624586 -2.036331 -0.780042
O  -4.853659 -1.10038 0.20072
O  -7.493306 1.326139 -0.312852
O  -7.553402 -0.750102 0.75762
N  3.362366 -2.015752 0.04928
C  5.470819 -0.996607 0.886924
C  4.801832 -1.822231 -0.230105
C  4.705877 0.288096 1.235998
C  2.742984 -3.161699 -0.644689
C  1.265314 -3.264648 -0.272618
C  3.757121 2.256208 0.103821
C  -0.743449 -1.847467 -0.508661
C  -1.297775 -0.631283 -0.967972
C  -1.563992 -2.783819 0.17228
C  3.332212 2.834684 1.326328
C  3.540298 2.934266 -1.122178
C  -3.478698 -1.277633 -0.073652
C  -2.660943 -0.340564 -0.754933
C  -2.926277 -2.493738 0.386032
C  2.690691 4.095878 1.307939
C  2.899758 4.188537 -1.122504
C  2.470653 4.779148 0.092515
C  -5.453333 0.138912 -0.254921
C  -6.92596 0.129097 0.142749
C  -8.935212 1.505578 -0.013692
H  5.489724 -1.600341 1.82194
H  5.006251 -1.313628 -1.196607
H  5.297707 -2.809285 -0.263234
H  2.829281 -1.15906 -0.159438
H  5.31268 0.93056 1.910134
H  3.764884 0.015419 1.75623
H  2.82768 -3.106966 -1.757402
H  3.247777 -4.093797 -0.322197
H  0.799917 -4.154629 -0.743667
H  1.150495 -3.317545 0.828714
H  7.340058 -0.229851 1.086481
H  -0.648787 0.079336 -1.488781
H  -1.159711 -3.73212 0.537241
H  3.484728 2.321812 2.280504
H  3.883234 2.464424 -2.049248
H  -3.060659 0.609822 -1.120949
H  -3.577748 -3.200202 0.908962
H  2.36144 4.540652 2.253998
H  2.736985 4.708757 -2.073118
H  1.974286 5.755162 0.088329
H  -5.3839 0.248637 -1.357107
H  -4.968327 1.024331 0.206345
H  -9.191866 2.482173 -0.446589
H  -9.101883 1.496911 1.076522
H  -9.524391 0.696824 -0.477475
