program: Gaussian 09
title: 000132293
version: EM64L-G09RevD.01
frameworkgroup: C1[X(C16H18N4O7S)]
method: RPBEPBE
basis: SDD
operation: Freq
keyword: #p
keyword: freq=noraman
keyword: PBEPBE/SDD
title: #p freq=noraman PBEPBE/SDD
converged: YES YES NO NO
title: Mulliken charges:
elementType: S O O O O O O O N N N N C C C C C C C C C C C C C C C C H H H H H H H H H H H H H H H H H H
charge: 0.915634 -0.459289 -0.432978 -0.542963 -0.525515 -0.508060 -0.465201 -0.186795 -0.581639 -0.057792 -0.023409 -0.029431 -0.111859 -0.149322 -0.187349 -0.066551 -0.276919 -0.404306 -0.029626 0.504703 0.191654 -0.287996 -0.418416 -0.374130 -0.231162 0.135712 -0.251949 -0.381432 0.250062 0.222572 0.299548 0.293714 0.343822 0.266102 0.215791 0.204344 0.385462 0.357128 0.307513 0.386921 0.289450 0.289261 0.253287 0.249063 0.258065 0.364286
chargesum: 0.00000
title: Mulliken charges with hydrogens summed into heavy atoms:
elementType: S O O O O O O O N N N N C C C C C C C C C C C C C C C C
charge: 0.915634 -0.073827 -0.075850 -0.156043 -0.525515 -0.508060 -0.100915 -0.186795 -0.237818 -0.057792 -0.023409 -0.029431 0.138202 0.073249 0.112199 0.227163 -0.276919 0.077587 0.174718 0.504703 0.191654 0.019516 -0.128966 -0.084868 0.022125 0.135712 -0.002886 -0.123367
polarizability: 3.53611146e+02 -4.30440889e+01 2.01109754e+02 9.90145839e+00 -1.25299452e+01 2.36543548e+02
1716.lowfreq: -6.6194 -1.7241 -0.0018 -0.0012 -0.0003 7.2566 17.6675 27.1481 29.3990
frequency: 17.2639 27.0747 29.2165 38.0111 43.0055 60.2190 69.2227 86.7378 98.3825 106.7798 115.1402 131.7838 141.4963 151.9576 158.0033 173.9846 179.6500 195.5084 205.0204 222.0673 225.3105 244.4433 259.3176 268.3215 284.3578 297.2061 321.8569 324.6960 336.2510 348.4831 368.0523 372.1945 410.6200 422.4460 430.6860 459.9848 464.1505 466.2951 492.0076 499.9017 510.6458 514.7563 544.2181 578.2214 583.0818 600.1858 617.1775 653.1655 665.2370 694.9908 705.6347 746.1728 748.4928 752.3786 781.8568 796.8977 799.7959 813.2645 832.8627 840.1708 841.1515 845.4390 892.7933 900.1415 903.6529 927.4259 943.3774 958.6811 963.2523 980.4229 992.5852 995.5476 1003.3942 1008.7276 1036.8752 1060.6308 1065.4936 1088.7084 1093.2565 1114.7208 1143.2260 1149.3558 1170.7021 1194.9260 1198.3067 1207.4365 1208.9476 1242.0988 1256.7007 1263.0395 1286.8003 1301.5946 1322.5108 1323.6367 1336.0232 1348.6584 1358.5843 1360.3737 1365.2286 1367.9938 1378.0645 1383.0698 1391.5508 1403.3635 1427.8729 1447.4599 1451.7790 1462.3830 1501.1940 1564.0955 1584.6673 1625.3986 1634.8496 2056.0352 2917.0871 2972.4606 3004.6895 3009.7884 3015.5507 3041.0226 3114.9638 3138.8724 3147.1050 3158.2463 3159.5032 3177.7112 3178.3698 3201.1793 3249.4853 3480.1167 3524.1120 3531.7264
redmass: 7.4172 8.3890 7.0055 6.9628 4.8398 7.7719 6.5086 7.8700 10.3088 7.9546 7.5399 5.4273 4.3813 7.3753 6.5409 4.9996 4.5089 5.0450 6.9281 5.5032 7.2844 6.1172 3.3686 4.9235 6.4184 5.1704 6.5511 5.0116 5.1941 5.6424 1.8029 2.1238 9.9554 1.4267 9.0139 9.5973 6.9211 3.3379 5.6710 3.3143 4.6096 7.4067 7.6281 3.1756 2.0446 1.4841 1.1409 5.0822 9.0051 3.6301 4.0718 5.5720 1.7735 2.9093 5.8283 4.7829 8.1354 1.3419 4.7493 3.6930 3.6643 2.8123 1.5619 1.9189 1.8409 5.8476 5.0999 1.3764 3.2654 1.3771 2.1620 6.8920 2.4648 1.3536 2.0831 2.5292 2.5986 1.9997 2.8004 3.4654 1.2128 2.3827 1.3334 1.4678 1.3490 1.4816 1.4155 1.3125 1.8627 1.2647 1.1632 1.3082 1.4251 2.7812 1.2309 1.2625 1.2237 1.2175 2.4642 1.2110 1.1935 1.7012 3.5332 3.2596 3.8596 2.3409 1.1582 1.0820 3.9781 7.2653 5.6222 7.1980 8.4524 13.9760 1.0804 1.0899 1.0851 1.0667 1.0835 1.0855 1.0999 1.0891 1.0889 1.0917 1.0907 1.0991 1.0980 1.0716 1.0682 1.0651 1.0667 1.0651
irintensity: 0.4976 0.5575 1.2637 0.2807 4.0465 0.9846 0.3572 2.4462 1.7015 0.9490 3.7305 1.4793 11.0950 4.5567 4.5706 4.0239 1.0756 2.0984 12.9493 3.7529 7.6392 3.8512 1.3455 10.9493 24.4121 5.7547 2.1340 14.2674 21.1946 2.8172 65.0392 43.0135 49.6238 88.8050 14.3189 4.1589 36.8154 0.1743 6.7329 21.1285 42.3185 1.5033 12.8653 0.9345 66.1449 43.0757 197.3563 2.9021 18.7569 15.6394 12.1643 2.0557 0.8010 11.6252 3.0052 39.0687 59.4999 148.7539 47.4334 50.5602 22.7754 0.9336 89.6580 58.7893 13.7576 44.0300 68.4270 0.2536 4.8588 2.5711 12.5373 18.3049 68.0783 1.7589 66.0312 4.4525 42.2272 9.2009 40.9045 20.6095 41.5070 0.9924 1.0897 4.2430 45.8756 3.1792 9.8079 21.4170 12.6718 64.4126 30.6196 7.8750 11.6749 96.7014 6.2769 2.8898 5.1198 6.3797 108.5238 26.7795 6.4071 21.2280 17.4357 12.4735 21.9980 52.1096 112.5374 13.5370 25.0977 29.4760 9.2113 19.6775 133.7942 688.5588 20.5823 74.9011 41.7303 15.9578 9.3938 23.8364 12.1931 6.0915 7.4496 2.0852 3.9207 6.2151 5.2672 130.0695 273.6363 36.0288 41.5644 18.3820
temp: 298.150 k
press: 1.00000 atm
elementType: 16 8 8 8 8 8 8 8 7 7 7 7 6 6 6 6 6 6 6 6 6 6 6 6 6 6 6 6 1 1 1 1 1 1 1 1 1 1 1 1 1 1 1 1 1 1
symmnumber: 1
zpe: 877356.2 jmol-1
zpe.correction: 0.334167 hartree
zpe.thermalcorrener: 0.362121 hartree
zpe.thermalcorrenthalpy: 0.363066 hartree
zpe.thermalcorrgfe: 0.274428 hartree
zpe.sumelectzpe: -1761.795046 hartree
zpe.sumelectthermal: -1761.767092 hartree
zpe.sumelectthermalent: -1761.766148 hartree
zpe.sumelectthermalfe: -1761.854786 hartree
dipole: -5.3353 1.3887 1.7169
dipole: 5.7742
quadrupole: -188.6856 -197.3112 -163.9304
quadrupole: 10.5359 10.8579 -11.3647
quadrupole: -5.3765 -14.0021 19.3786 10.5359 10.8579 -11.3647
hfenergy: -1762.1292135 hartree
pointgroup: C01 [X(C16H18N4O7S1)]
dipole: -2.1683123 -0.4073198 -0.5416218 debye
polarizability: 352.6347134|40.697522|205.3324148|-15.0409173|-21.7850141|233.2973196 unknown
InChI: InChI=1S/C16H18N4O7S/c17-20-18-11-5-1-4-10-9(11)3-2-6-14(10)28(26,27)19-12(7-21)15(24)16(25)13(23)8-22/h1-7,12-13,15-16,19,22-25H,8H2
charge 0 multiplicity 1
46 atoms
S  1.72014 1.999666 0.483744
O  3.726644 -2.57121 -0.244402
O  1.664765 -2.927563 -2.447171
O  1.320293 -3.394523 0.37576
O  2.498239 2.748487 -0.744458
O  1.66723 2.632164 1.980951
O  -1.401187 -3.073719 0.504459
O  5.07969 0.202361 1.339063
N  2.426917 0.249465 0.691811
N  -4.58102 -0.058131 0.141972
N  -5.553855 -0.630521 0.717204
N  -6.56704 -1.130459 1.072897
C  3.125707 -1.509868 -1.057351
C  1.661705 -1.837085 -1.461833
C  3.372684 -0.117452 -0.389428
C  0.742692 -2.187718 -0.271505
C  -0.033002 1.652447 -0.16311
C  -0.699742 -2.522946 -0.678542
C  4.812862 -0.141234 0.165965
C  -1.015869 1.020112 0.665066
C  -2.311896 0.797967 0.046014
C  -0.262078 2.073364 -1.467062
C  -0.792147 0.599171 2.017927
C  -2.552435 1.229932 -1.297851
C  -1.552983 1.859743 -2.040344
C  -3.332886 0.125005 0.814741
C  -1.808322 -0.0527 2.721711
C  -3.079801 -0.305204 2.128079
H  3.706296 -1.502772 -2.001073
H  1.2302 -0.976098 -2.00456
H  3.345631 0.66562 -1.183431
H  0.766321 -1.353017 0.453594
H  2.962845 0.339243 1.5913
H  -0.709696 -3.32969 -1.427129
H  -1.222143 -1.636653 -1.085644
H  5.595406 -0.488801 -0.543397
H  3.003895 -3.010645 0.302948
H  2.051602 -3.72328 -1.99474
H  0.539568 2.565546 -2.028108
H  0.590491 -3.807162 0.912698
H  0.162659 0.815781 2.503311
H  -3.542044 1.053038 -1.728485
H  -1.747613 2.191263 -3.064518
H  -1.634275 -0.367916 3.755419
H  -3.860589 -0.810652 2.707298
H  -1.680658 -2.329758 1.09971
