program: Gaussian 09
title: 000132277
version: EM64L-G09RevD.01
frameworkgroup: C1[X(C8H13NO4S)]
method: RPBEPBE
basis: SDD
operation: Freq
keyword: #p
keyword: freq=noraman
keyword: PBEPBE/SDD
title: #p freq=noraman PBEPBE/SDD
converged: YES YES NO NO
title: Mulliken charges:
elementType: S O O O O N C C C C C C C C H H H H H H H H H H H H H
charge: 0.110082 -0.395071 -0.239236 -0.276233 -0.190587 -0.364079 -0.104106 -0.677980 -0.643269 0.173837 -0.405508 0.277298 -0.769544 -0.048764 0.304242 0.289728 0.284727 0.316833 0.275002 0.305941 0.243570 0.243996 0.255468 0.256332 0.214754 0.177337 0.385228
chargesum: 0.00000
title: Mulliken charges with hydrogens summed into heavy atoms:
elementType: S O O O O N C C C C C C C C
charge: 0.110082 -0.009843 -0.239236 -0.276233 -0.190587 -0.047246 0.200137 -0.103525 -0.062326 0.173837 0.082058 0.277298 -0.042990 0.128573
polarizability: 1.69369177e+02 -1.03349967e+01 1.01544932e+02 -2.54312175e+00 -8.08041965e+00 1.02749069e+02
1716.lowfreq: -5.0247 -0.0027 -0.0016 0.0001 11.0294 12.3254 22.8172 29.4639 34.9121
frequency: 21.4979 29.4244 34.8399 39.4896 51.5253 73.4306 95.6030 102.5994 110.6695 123.4266 170.7420 196.2383 209.7659 250.8311 293.4243 351.5615 356.3317 445.9723 509.5208 514.0679 586.1987 590.8091 598.6863 612.9505 630.9941 655.2229 678.4483 702.9585 769.5836 801.0751 842.7727 888.8003 913.1614 951.7380 985.8303 1007.3664 1014.6459 1043.2200 1073.7147 1083.2667 1136.8593 1147.2268 1203.4201 1228.4936 1247.4128 1253.7443 1264.3577 1289.7539 1301.5123 1325.6675 1331.9369 1376.2358 1389.5596 1423.4856 1432.0731 1450.9895 1463.5822 1467.8344 1477.2767 1615.2852 1645.4396 1647.9532 2864.7935 2942.9633 2961.2804 2999.4335 3007.6741 3043.5079 3052.9977 3098.6518 3106.2673 3121.5743 3131.5352 3510.1268 3551.0959
redmass: 8.8341 4.3242 4.0077 6.2209 7.9951 2.2169 1.7138 2.9233 5.4533 4.6094 1.8326 6.4660 5.7871 4.0646 4.4468 3.3065 3.5319 3.5499 3.4795 3.5137 2.0833 4.2561 3.0421 2.1292 3.9524 1.7284 1.1660 4.1535 3.9899 3.2600 1.2582 3.0993 2.4993 4.5183 1.9436 2.0434 1.4340 1.6561 1.9727 2.5915 2.1714 1.2926 1.3626 1.4275 1.4020 1.5311 1.1451 1.5314 1.4747 1.7991 1.7990 1.2111 1.2297 1.0869 1.1035 1.0583 1.2959 1.0887 1.5644 6.3278 7.5385 9.1555 1.0848 1.0791 1.0628 1.0360 1.0959 1.0574 1.0580 1.0988 1.1001 1.1086 1.1080 1.0640 1.0781
irintensity: 3.7451 1.9263 3.1839 2.6516 2.2121 9.3273 3.6165 4.9346 1.5701 9.6564 2.1812 13.5234 4.6139 1.2750 1.2549 2.6133 7.6525 7.1606 16.0288 22.5251 118.1931 38.9338 13.0456 32.5130 34.1877 88.3338 11.3882 19.5172 3.8537 13.0567 0.4103 16.2598 7.9767 18.2402 32.9977 40.1694 2.1844 6.6666 156.2474 18.5816 7.4199 0.8403 23.3493 1.4370 2.7001 60.2349 2.4607 79.1456 31.3466 73.3851 18.8050 5.2671 71.1406 18.8776 37.5544 25.3186 172.8725 5.6837 132.2943 177.2857 87.8295 275.0314 163.4346 51.4175 38.8764 8.8070 8.1210 8.4638 10.0816 11.6790 14.7547 5.1874 3.6752 32.1012 29.5179
temp: 298.150 k
press: 1.00000 atm
elementType: 16 8 8 8 8 7 6 6 6 6 6 6 6 6 1 1 1 1 1 1 1 1 1 1 1 1 1
symmnumber: 1
zpe: 543848.7 jmol-1
zpe.correction: 0.207141 hartree
zpe.thermalcorrener: 0.223967 hartree
zpe.thermalcorrenthalpy: 0.224911 hartree
zpe.thermalcorrgfe: 0.158616 hartree
zpe.sumelectzpe: -1065.264790 hartree
zpe.sumelectthermal: -1065.247964 hartree
zpe.sumelectthermalent: -1065.247020 hartree
zpe.sumelectthermalfe: -1065.313315 hartree
dipole: -0.2942 -2.0712 4.3774
dipole: 4.8517
quadrupole: -109.0550 -88.5918 -85.1947
quadrupole: 5.4883 0.1976 3.3305
quadrupole: -14.7745 5.6887 9.0858 5.4883 0.1976 3.3305
hfenergy: -1065.4719312 hartree
pointgroup: C01 [X(C8H13N1O4S1)]
dipole: 0.2566286 0.5768771 1.8013384 debye
polarizability: 161.6500158|-24.2671713|107.5101661|2.7056315|7.3937969|104.5029967 unknown
InChI: InChI=1S/C8H13NO4S/c1-6(11)9-7(8(12)13)5-14-4-2-3-10/h3,7,9,12H,2,4-5H2,1H3
charge 0 multiplicity 1
27 atoms
S  1.26901 1.164799 0.121873
O  -1.693331 -1.760946 1.017424
O  0.005287 -2.136523 -0.514834
O  -3.841419 1.024373 -0.931337
O  5.13927 -1.531129 -0.388378
N  -1.919629 0.852225 0.360454
C  -1.237539 0.000134 -0.609335
C  0.010585 0.674315 -1.215827
C  2.64694 -0.095658 -0.231529
C  -0.88234 -1.385039 -0.052967
C  3.718406 0.051342 0.854979
C  -3.214076 1.303851 0.136317
C  -3.819515 2.148609 1.24876
C  4.95221 -0.80577 0.616122
H  -1.984989 -0.160547 -1.419951
H  0.519178 -0.004889 -1.917647
H  -0.283286 1.598564 -1.736181
H  -1.43576 1.06374 1.2351
H  3.065823 0.120544 -1.227275
H  2.205132 -1.103781 -0.240354
H  3.314674 -0.202825 1.857526
H  4.063509 1.105303 0.938058
H  -4.181074 3.100243 0.824053
H  -4.696504 1.620896 1.662428
H  -3.114057 2.364453 2.069222
H  5.722048 -0.740546 1.428889
H  -1.455654 -2.688039 1.293809
