program: Gaussian 09
title: 000132224
version: EM64L-G09RevD.01
frameworkgroup: C1[X(C16H17NO3)]
method: RPBEPBE
basis: SDD
operation: Freq
keyword: #p
keyword: freq=noraman
keyword: PBEPBE/SDD
title: #p freq=noraman PBEPBE/SDD
converged: YES YES NO NO
title: Mulliken charges:
elementType: O O O N C C C C C C C C C C C C C C C C H H H H H H H H H H H H H H H H H
charge: -0.447357 -0.440695 -0.489215 -0.316061 -0.380597 0.383891 -0.475733 0.125069 -0.528560 0.574230 0.185269 -0.415437 0.119292 -0.419932 -0.462604 -0.508766 -0.830102 0.187111 -0.333558 0.113868 0.216120 0.228848 0.194629 0.201767 0.236452 0.271161 0.239304 0.213856 0.284176 0.229124 0.230225 0.218143 0.276164 0.215879 0.354742 0.379791 0.369506
chargesum: 0.00000
title: Mulliken charges with hydrogens summed into heavy atoms:
elementType: O O O N C C C C C C C C C C C C C C C C
charge: -0.092615 -0.060904 -0.119708 -0.044900 -0.164476 0.383891 -0.052256 0.125069 -0.090341 0.574230 0.185269 -0.176133 0.119292 -0.206076 -0.178429 -0.279642 -0.105571 0.187111 -0.117679 0.113868
polarizability: 2.42540633e+02 -4.62953133e+00 1.62229000e+02 -1.82484094e+01 7.36532974e+00 1.66240596e+02
1716.lowfreq: -0.0008 -0.0005 0.0003 3.8049 5.7216 12.1339 20.6636 36.9820 43.9758
frequency: 19.1344 36.9741 43.9453 107.2667 123.9211 127.3964 144.2461 169.9846 219.1727 231.4310 247.0414 255.4584 267.1852 282.4018 309.5027 323.2298 328.7756 347.6809 357.8775 413.9767 428.2660 444.2605 455.7544 476.3443 477.7859 502.2531 515.3457 535.6895 559.0159 580.8214 595.9072 630.4192 667.5316 700.1297 717.6646 740.2377 743.1874 759.7403 783.6530 798.0417 824.1351 850.7415 878.8901 902.1588 910.1478 925.9544 939.0481 974.4174 980.8054 1010.6966 1040.3663 1046.4946 1072.2935 1081.9761 1138.9164 1146.3066 1149.4327 1170.7129 1180.1420 1190.7565 1200.6525 1220.6450 1227.1855 1239.7722 1241.5136 1259.1255 1261.1164 1268.0640 1296.9099 1318.7189 1335.1781 1374.0497 1392.6579 1399.8822 1408.8385 1432.1394 1444.3061 1462.3725 1465.9366 1470.2615 1472.7424 1483.8279 1486.3295 1498.2109 1599.6201 1606.8859 1620.8449 1626.8264 2807.5656 2849.7459 2971.5723 2973.6036 3010.8970 3041.5313 3052.7019 3107.3501 3112.0058 3114.9886 3136.4867 3137.1757 3183.0481 3497.0187 3525.6866 3587.4891 3624.0804
redmass: 5.1553 5.9049 4.3473 4.4227 1.5636 1.7470 4.4607 3.8264 4.0709 3.9160 1.3024 2.7518 3.5507 5.0681 2.3475 3.6476 3.4148 1.2801 5.5709 3.0817 3.1625 4.0872 3.4010 3.2648 1.2138 3.7381 4.7024 1.9486 5.8029 4.3671 3.4773 3.9825 5.3910 3.7693 3.5611 3.3411 4.5350 5.0516 1.4839 1.5800 3.7435 3.2460 1.7798 1.5196 2.4076 1.5041 2.3382 2.5559 2.0975 2.1151 1.5551 1.7317 2.3035 2.0483 1.3642 1.5740 1.7184 1.8441 1.3555 1.5255 1.5335 1.4390 1.6973 1.9507 1.6492 1.3899 3.3131 2.9731 1.3937 1.6586 1.6811 1.8424 2.1985 1.4424 4.6163 2.2329 1.3391 1.8902 1.5059 1.2524 1.3334 1.1880 1.7487 3.2712 7.8062 6.9867 6.5044 6.7672 1.0714 1.0713 1.0404 1.0832 1.0850 1.0963 1.0892 1.0874 1.0871 1.0956 1.0963 1.0962 1.0921 1.0760 1.0648 1.0659 1.0665
irintensity: 1.5137 0.3697 0.1851 1.9052 0.5826 0.6313 1.0616 0.7363 20.8573 15.7079 118.5891 28.0032 11.0065 6.3567 4.4355 9.9733 11.7317 110.6647 1.2162 9.7077 8.9619 21.1044 12.8526 18.1339 98.6824 2.5946 7.7116 74.4510 5.9566 7.6364 34.6537 15.3013 1.4867 16.7900 2.2134 21.7064 6.0798 34.6130 39.9937 27.6360 16.2868 18.6222 7.4797 1.4599 5.7775 2.3819 18.9243 28.4971 10.8346 9.4432 18.8915 92.9133 134.7804 77.4432 2.6459 47.5270 50.1604 12.1508 72.9522 15.9210 35.7814 16.1974 46.1160 5.6888 7.9117 26.2588 142.0983 108.3232 82.7051 6.8567 16.7800 0.5420 13.7323 12.8564 8.2054 12.0335 4.7931 4.0690 2.9804 1.7979 14.4331 28.1938 66.7590 134.3457 9.7762 36.5046 16.0372 0.9018 116.0230 146.9970 32.0440 36.0021 26.3166 22.2881 36.9939 18.4806 17.5182 7.0110 8.0733 27.4663 0.7722 0.5378 77.7692 34.2096 55.0928
temp: 298.150 k
press: 1.00000 atm
elementType: 8 8 8 7 6 6 6 6 6 6 6 6 6 6 6 6 6 6 6 6 1 1 1 1 1 1 1 1 1 1 1 1 1 1 1 1 1
symmnumber: 1
zpe: 775961.3 jmol-1
zpe.correction: 0.295548 hartree
zpe.thermalcorrener: 0.313833 hartree
zpe.thermalcorrenthalpy: 0.314777 hartree
zpe.thermalcorrgfe: 0.249100 hartree
zpe.sumelectzpe: -898.862652 hartree
zpe.sumelectthermal: -898.844367 hartree
zpe.sumelectthermalent: -898.843423 hartree
zpe.sumelectthermalfe: -898.909099 hartree
dipole: 1.5426 0.1006 -2.8174
dipole: 3.2136
quadrupole: -98.9074 -102.3949 -116.9853
quadrupole: -2.6360 -6.5302 5.4371
quadrupole: 7.1885 3.7010 -10.8895 -2.6360 -6.5302 5.4371
hfenergy: -899.1581996 hartree
pointgroup: C01 [X(C16H17N1O3)]
dipole: -0.5935774 -0.1071666 1.1111934 debye
polarizability: 242.0015244|7.5778976|164.2876294|-18.3036362|-7.887399|164.7210752 unknown
InChI: InChI=1S/C16H17NO3/c1-9-12-7-17-8-13(11(12)3-5-14(9)18)10-2-4-15(19)16(20)6-10/h2-6,13,17-20H,7-8H2,1H3
charge 0 multiplicity 1
37 atoms
O  4.53365 -2.017923 -0.668752
O  -3.105923 -0.292516 -2.487833
O  -5.132093 -1.023792 -0.865232
N  0.477185 2.581228 -0.146295
C  -0.112777 0.73874 1.384688
C  1.113311 0.020995 0.803033
C  0.045571 2.277756 1.225767
C  2.047873 0.674993 -0.046439
C  1.846492 2.13642 -0.43802
C  -1.44079 0.237458 0.807747
C  3.200729 -0.007655 -0.532768
C  1.332929 -1.335892 1.142025
C  3.384686 -1.363683 -0.16603
C  2.456506 -2.033888 0.665064
C  -1.654332 0.178487 -0.593937
C  -2.491377 -0.139042 1.681803
C  4.213361 0.679941 -1.430286
C  -2.894773 -0.240861 -1.103524
C  -3.742805 -0.566716 1.175096
C  -3.938547 -0.615312 -0.215393
H  -0.137704 0.530747 2.474356
H  -0.920057 2.775316 1.422515
H  0.779464 2.637792 1.991621
H  2.625968 2.746489 0.093531
H  2.038208 2.261526 -1.520522
H  0.282205 3.54069 -0.447795
H  0.608444 -1.849521 1.784913
H  2.612848 -3.086291 0.936997
H  -0.862169 0.472985 -1.286139
H  -2.335676 -0.100688 2.766425
H  3.786262 0.893482 -2.429995
H  4.541847 1.646817 -1.004492
H  5.098997 0.043414 -1.57381
H  -4.54875 -0.859625 1.860307
H  4.556471 -2.955989 -0.356969
H  -4.031706 -0.612215 -2.654581
H  -5.829228 -1.284468 -0.217775
