program: Gaussian 09
title: 000132213
version: EM64L-G09RevD.01
frameworkgroup: C1[X(C5H9NO3)]
method: RPBEPBE
basis: SDD
operation: Freq
keyword: #pfreq=noraman
keyword: PBEPBE/SDD
title: #p freq=noraman PBEPBE/SDD
converged: YES YES NO NO
title: Mulliken charges:
elementType: O O O N C C C C C H H H H H H H H H
charge: -0.401780 -0.243969 -0.281030 -0.405623 -0.095897 -0.667998 0.152520 0.261597 -0.771774 0.286127 0.269763 0.238519 0.212892 0.336389 0.253552 0.252600 0.215413 0.388698
chargesum: 0.00000
title: Mulliken charges with hydrogens summed into heavy atoms:
elementType: O O O N C C C C C
charge: -0.013082 -0.243969 -0.281030 -0.069234 0.190230 0.053177 0.152520 0.261597 -0.050209
polarizability: 8.79932134e+01 -9.77710386e-01 7.18156388e+01 1.72219127e-01 -5.25461847e+00 5.05456071e+01
1716.lowfreq: -12.5658 -0.0005 -0.0002 0.0007 5.0116 7.0704 58.3571 72.1308 79.2389
frequency: 58.3037 72.1037 79.2335 115.6471 150.8120 219.4545 232.3104 297.0557 338.5614 391.2687 491.6856 563.9257 580.5889 601.5102 613.6093 625.8041 703.3123 810.7316 898.4770 958.4383 990.8747 1043.7128 1059.1968 1066.9700 1087.5973 1170.1773 1232.9662 1262.4356 1307.3563 1348.5699 1386.2563 1387.8894 1450.7665 1457.6812 1469.7481 1480.5310 1491.9253 1607.5617 1651.5547 2998.0648 3001.5766 3015.2956 3098.6590 3102.7607 3107.6295 3119.7624 3519.5212 3521.1723
redmass: 4.2872 5.6266 1.3075 2.7868 3.8280 1.8804 1.4980 4.5776 4.1087 3.1864 3.4031 3.0855 2.0314 1.5290 3.1067 1.5521 3.4416 2.9199 2.6579 2.8094 1.5493 1.6538 2.2350 1.7877 2.6036 2.4969 1.4114 1.8947 1.3143 1.9846 1.2840 1.2514 1.0463 1.2020 1.0986 1.0470 1.7729 7.0155 8.1790 1.0358 1.0356 1.0815 1.0981 1.1008 1.1011 1.1015 1.0671 1.0752
irintensity: 0.8136 6.6117 5.0878 4.6053 11.9491 0.2535 0.1141 0.5070 1.2808 6.9456 53.0234 48.3647 13.3241 146.6498 23.9947 5.4383 57.7999 4.2201 3.2275 44.3969 12.6724 16.1480 162.3168 102.4165 6.1886 0.6024 2.3769 9.4793 19.0235 99.5713 22.1712 74.7672 15.8729 160.0921 11.9027 16.8453 136.2855 243.0893 154.0536 10.0386 15.9020 14.3301 9.6552 18.8925 19.7639 9.2377 65.3567 27.3420
temp: 298.150 k
press: 1.00000 atm
elementType: 8 8 8 7 6 6 6 6 6 1 1 1 1 1 1 1 1 1
symmnumber: 1
zpe: 372284.1 jmol-1
zpe.correction: 0.141796 hartree
zpe.thermalcorrener: 0.152109 hartree
zpe.thermalcorrenthalpy: 0.153054 hartree
zpe.thermalcorrgfe: 0.105485 hartree
zpe.sumelectzpe: -475.667802 hartree
zpe.sumelectthermal: -475.657488 hartree
zpe.sumelectthermalent: -475.656544 hartree
zpe.sumelectthermalfe: -475.704113 hartree
dipole: -1.9899 -1.6013 1.1930
dipole: 2.8191
quadrupole: -47.0818 -58.8473 -53.8723
quadrupole: -7.7936 4.6529 3.2956
quadrupole: 6.1853 -5.5802 -0.6052 -7.7936 4.6529 3.2956
hfenergy: -475.8095973 hartree
pointgroup: C01 [X(C5H9N1O3)]
dipole: 0.817516 0.6139629 0.4299274 debye
dipolederiv: -1.0263874 0.4172769 0.2647835 0.3743862 -0.467076 -0.1012745 0.252252 -0.1107211 -0.4927244 -0.6851506 -0.1491014 0.0451644 0.0955831 -0.9496637 -0.1468461 0.1094879 -0.1634682 -0.3526129 -0.7604845 0.0007824 -0.0558756 -0.2557675 -0.8294453 -0.2247968 -0.1611466 -0.1769336 -0.4800512 -1.2376811 -0.0550941 -0.1577651 -0.1416641 -0.4644331 0.0500653 -0.1624051 0.0351995 -0.4856084 0.2675702 -0.2238954 0.0664097 -0.4712114 0.0587548 -0.0238423 -0.0494676 -0.0399221 0.2759166 -0.1397991 -0.0538271 0.0019732 0.0743902 0.0142076 0.0415068 -0.0218758 0.0454635 0.0471413 1.4284989 -0.002491 -0.3400459 -0.1493768 1.2422475 0.2954506 -0.3295487 0.3317612 0.326003 1.6017047 0.0209406 0.2111017 0.2487015 0.9497564 0.3543085 0.2795452 0.3046423 0.362761 -0.2777994 0.2280443 0.0549851 0.2051376 -0.1254675 -0.0327882 0.0537225 -0.0405297 0.004047 0.0766823 -0.004091 -0.0266537 0.0805096 0.071249 -0.0342359 0.0504235 -0.0160336 -0.0321774 0.0059098 -0.1048166 0.0203264 -0.10162 0.0503133 0.0201966 0.024584 0.0083352 0.087357 -0.0307436 0.1252404 0.0246346 0.1393104 0.0244179 -0.0014638 0.0202982 -0.0292436 0.0722968 0.1063447 -0.0020802 -0.0321416 -0.0256531 0.0247267 -0.10075 -0.0307119 -0.0297373 -0.1032143 0.2711099 -0.0014134 -0.0349091 0.1021665 0.1664218 -0.0533686 0.001181 -0.0512086 0.2993609 0.0679453 0.0278428 -0.0742296 0.0411373 0.0850498 0.0000958 -0.1032211 0.0384743 -0.0304714 0.0322948 -0.0295315 0.0824209 -0.0479706 0.0547797 0.0626903 0.1125804 0.0244192 0.0301803 0.0295719 -0.100776 -0.0455857 -0.027224 -0.0901816 -0.0800682 -0.0190533 -0.0877334 0.0821626 0.2704134 -0.0930097 -0.0045932 -0.140835 0.1843428 -0.0248796 -0.0266445 -0.0427639 0.3896335 unknown
polarizability: 87.8698018|-1.5917488|72.3221754|-0.5664925|4.4022876|50.1624821 unknown
InChI: InChI=1S/C5H9NO3/c1-3(5(8)9)6-4(2)7/h3,6,8H,1-2H3
charge 0 multiplicity 1
18 atoms
O  2.884467 -0.362151 -0.540735
O  1.887634 1.594508 0.215798
O  -2.17435 -1.054951 -0.547684
N  -0.594688 0.453897 0.228011
C  0.526632 -0.453812 -0.043347
C  0.654398 -1.585074 1.015745
C  1.796269 0.385814 -0.102629
C  -1.897253 0.086445 -0.061825
C  -2.964075 1.133486 0.239489
H  0.364044 -0.933627 -1.027694
H  -0.283681 -2.163034 1.016149
H  1.491861 -2.25568 0.761101
H  0.820214 -1.163761 2.022587
H  -0.361466 1.390783 0.569278
H  -3.529319 1.346435 -0.684019
H  -3.67949 0.720354 0.971474
H  -2.553687 2.078294 0.635201
H  3.701591 0.206374 -0.5504
