program: Gaussian 09
title: 000132118
version: EM64L-G09RevD.01
frameworkgroup: C1[X(C12H13NO4S)]
method: RPBEPBE
basis: SDD
operation: Freq
keyword: #p
keyword: freq=noraman
keyword: PBEPBE/SDD
title: #p freq=noraman PBEPBE/SDD
converged: YES YES NO NO
title: Mulliken charges:
elementType: S O O O O N C C C C C C C C C C C C H H H H H H H H H H H H H
charge: 0.029348 -0.179512 -0.213786 -0.385350 -0.220055 -0.539024 -0.678606 -0.172899 0.258043 0.280098 0.335916 -0.710584 0.223127 -0.281563 -0.346560 -0.283332 -0.229237 -0.218288 0.255573 0.245777 0.234081 0.222602 0.281363 0.279355 0.182709 0.247955 0.277470 0.238029 0.238449 0.238228 0.390671
chargesum: 0.00000
title: Mulliken charges with hydrogens summed into heavy atoms:
elementType: S O O O O N C C C C C C C C C C C C
charge: 0.212057 -0.179512 -0.213786 0.005321 -0.220055 0.021693 -0.678606 0.082674 0.258043 0.280098 0.335916 -0.008124 0.223127 -0.033608 -0.069090 -0.045303 0.009212 0.019941
polarizability: 2.24440635e+02 -1.05231779e+01 1.68667403e+02 1.13176261e+00 1.76477730e+01 1.22791856e+02
1716.lowfreq: -6.0449 -0.0020 -0.0019 -0.0012 4.3439 11.0520 31.2440 41.0650 52.4084
frequency: 30.9743 40.6885 52.3893 62.3259 79.1978 102.1141 116.9215 140.0468 158.4621 176.2293 190.3199 225.0704 234.2962 238.9419 257.1755 282.0863 314.2353 333.3252 369.6559 399.4189 404.0537 420.7759 440.2271 469.8196 503.0454 547.0101 574.3302 613.5339 631.1534 648.3240 673.3499 683.3924 687.0853 696.1286 735.8170 772.9879 786.8723 798.2379 854.1776 858.6723 911.8305 944.5320 953.3149 986.1738 990.0854 991.5772 1002.7258 1010.8034 1030.3183 1046.9624 1076.8694 1093.6309 1104.0954 1132.5448 1176.9592 1197.8080 1230.4003 1248.1316 1292.9588 1300.6806 1325.4652 1345.9045 1376.9134 1390.4153 1437.8800 1468.6835 1473.5809 1483.0743 1552.2730 1587.9529 1591.8689 1611.3275 1634.1174 1642.6931 2149.7210 2990.6487 3059.0051 3094.1258 3107.0631 3134.3526 3146.2125 3156.4592 3166.7630 3175.1082 3428.3445 3518.1475 3555.6933
redmass: 5.4234 4.9567 9.5213 3.7591 4.1234 7.0029 7.4488 7.6892 6.3959 6.1971 6.4809 3.1167 3.4560 1.6142 3.5135 2.2359 4.5764 1.5337 9.5557 2.9197 6.8225 2.7217 2.4634 1.3111 8.0819 1.5760 4.3985 6.1974 2.9808 6.0720 3.1459 3.3671 1.8646 2.2620 3.3291 2.0155 1.4012 5.7748 1.2537 3.8591 2.2275 1.9744 2.9815 2.1279 4.5474 1.4935 2.5977 1.3674 2.0950 1.9247 2.3565 1.6057 3.7110 2.5424 1.0599 1.1220 1.6854 4.2123 2.4856 1.4914 1.3258 1.2507 1.2139 8.4369 2.3049 1.0497 1.0497 2.2042 9.3493 7.9836 6.8348 6.0322 8.8320 1.1010 1.0380 1.0350 1.0867 1.0993 1.1005 1.0857 1.0885 1.0927 1.0961 1.1009 1.0448 1.0643 1.0970
irintensity: 0.5198 0.6468 0.4840 0.1457 0.2434 1.4639 0.0573 0.3636 0.1874 1.2707 3.6926 9.5544 1.5115 3.8262 8.7128 30.4829 6.1319 38.3836 12.1779 1.2084 18.1146 2.9806 13.0721 5.6514 1.1738 48.1017 40.3680 0.8352 108.2496 8.8483 112.2733 15.5477 151.2711 24.8185 184.9296 63.4744 129.6243 10.0024 1.0720 42.7413 18.0605 12.3964 47.4350 18.6420 1.5232 1.3350 13.8628 2.5992 2.1598 69.0272 59.1629 19.7490 224.2988 7.5168 1.6051 18.4470 4.1527 162.2504 57.3234 2.4556 3.2124 5.0026 30.5139 3.6717 21.2836 17.4759 6.4763 4.0472 176.9197 71.8185 27.3233 32.8640 190.2049 37.6608 167.9207 16.6220 7.3847 23.0676 15.8642 0.2730 5.9924 16.9865 13.7266 15.2836 5.8792 44.1475 3.4010
temp: 298.150 k
press: 1.00000 atm
elementType: 16 8 8 8 8 7 6 6 6 6 6 6 6 6 6 6 6 6 1 1 1 1 1 1 1 1 1 1 1 1 1
symmnumber: 1
zpe: 597708.5 jmol-1
zpe.correction: 0.227655 hartree
zpe.thermalcorrener: 0.246155 hartree
zpe.thermalcorrenthalpy: 0.247099 hartree
zpe.thermalcorrgfe: 0.180404 hartree
zpe.sumelectzpe: -1217.438202 hartree
zpe.sumelectthermal: -1217.419703 hartree
zpe.sumelectthermalent: -1217.418758 hartree
zpe.sumelectthermalfe: -1217.485453 hartree
dipole: -3.4717 0.4191 1.9069
dipole: 3.9830
quadrupole: -103.8509 -111.6905 -111.3648
quadrupole: -6.2515 -4.4575 0.0293
quadrupole: 5.1178 -2.7218 -2.3961 -6.2515 -4.4575 0.0293
hfenergy: -1217.6658577 hartree
pointgroup: C01 [X(C12H13N1O4S1)]
dipole: 1.3806781 0.347859 -0.6544901 debye
polarizability: 222.2318403|14.2565034|173.9228729|8.449782|-10.5521853|119.7451804 unknown
InChI: InChI=1S/C12H13NO4S/c1-7(13)9(14)12(18,11(16)17)10(15)8-5-3-2-4-6-8/h2-7,16,18H,13H2,1H3
charge 0 multiplicity 1
31 atoms
S  -2.15627 -2.35194 -0.294242
O  -1.226918 0.585344 1.617989
O  0.50405 -2.382813 0.86975
O  0.097193 -1.352491 -2.437141
O  -1.337444 0.471474 -2.424925
N  -4.128685 0.412527 1.047923
C  -0.964102 -0.840686 -0.347069
C  -3.100037 0.749479 0.044874
C  -1.706875 0.234487 0.507504
C  0.399521 -1.250312 0.312018
C  1.539709 -0.297323 0.281355
C  -3.034487 2.277953 -0.157813
C  -0.787453 -0.474132 -1.818291
C  1.43233 1.033176 -0.209083
C  2.793378 -0.757822 0.772794
C  2.559205 1.87899 -0.212752
C  3.916534 0.089285 0.768029
C  3.80284 1.41117 0.272974
H  -3.373437 0.270181 -0.909336
H  -4.043778 2.643174 -0.411758
H  -2.342628 2.536134 -0.977323
H  -2.697663 2.776549 0.769622
H  -4.28177 -0.599111 1.141365
H  -3.948386 0.852951 1.958736
H  -1.157215 -3.037888 0.439828
H  0.477611 1.429331 -0.567554
H  2.858501 -1.782523 1.151492
H  2.467093 2.90436 -0.585353
H  4.877229 -0.274108 1.147615
H  4.675931 2.073091 0.26977
H  0.179723 -1.12591 -3.402899
