program: Gaussian 09
title: 000132101
version: EM64L-G09RevD.01
frameworkgroup: C1[X(C7H15NO2S)]
method: RPBEPBE
basis: SDD
operation: Freq
keyword: #p
keyword: freq=noraman
keyword: PBEPBE/SDD
title: #p freq=noraman PBEPBE/SDD
converged: YES YES NO NO
title: Mulliken charges:
elementType: S O O N C C C C C C C H H H H H H H H H H H H H H H
charge: 0.698079 -0.292440 -0.642325 -0.126752 -0.482658 0.261990 -0.358340 -0.666774 -0.624784 -0.643602 -0.802695 0.283932 0.238288 0.221022 0.213621 0.246926 0.273860 0.224132 0.285148 0.228158 0.221918 0.219092 0.226431 0.272123 0.257960 0.267691
chargesum: 0.00000
title: Mulliken charges with hydrogens summed into heavy atoms:
elementType: S O O N C C C C C C C
charge: 0.698079 -0.292440 -0.642325 -0.126752 -0.198726 0.261990 0.100971 0.067632 0.112653 0.023839 -0.004920
polarizability: 1.39147450e+02 -1.69728320e+00 9.93991660e+01 1.07963309e+00 4.96808991e+00 1.02950064e+02
1716.lowfreq: -17.3475 -14.3501 -10.4230 0.0027 0.0033 0.0034 22.8792 46.5816 57.3454
frequency: 21.4941 46.5437 57.1615 74.7442 113.2365 127.9016 135.1063 161.8844 182.0973 203.2370 217.2768 239.8417 250.7525 266.1696 307.2313 335.2839 369.3667 414.2066 423.7182 559.9911 574.4696 615.7701 695.5263 740.1770 780.2703 789.5924 902.0851 934.9088 959.8457 970.9205 999.2399 1058.3017 1061.8275 1073.8851 1081.8832 1115.2273 1122.2913 1193.0822 1224.6645 1257.7609 1292.7079 1294.7440 1342.9611 1381.8587 1384.8879 1400.2469 1416.5394 1421.2931 1432.2193 1466.2264 1467.2029 1474.1695 1475.6311 1481.2367 1486.1911 1491.0599 1560.2982 2974.0660 2977.7690 2986.2761 2998.8601 3013.9870 3038.9199 3052.1245 3065.3712 3070.7093 3085.3926 3093.8526 3095.0296 3118.5300 3153.0210 3163.8620
redmass: 3.4665 3.6957 3.0791 2.8423 1.1856 4.6162 1.0710 2.1026 2.8921 1.3497 4.0068 1.0788 3.3612 3.9924 3.6607 3.9473 3.9390 3.6585 2.6821 5.8134 4.2680 3.6100 6.9249 3.1999 1.1779 10.1251 2.3923 1.2019 1.3289 2.3792 1.5953 1.4332 1.9857 2.6629 1.6041 1.5460 1.4094 1.4198 3.3554 1.5232 1.1495 1.5161 1.2795 1.3156 1.2130 1.5500 1.4703 1.0588 1.0569 1.0452 1.0470 1.0644 1.0495 1.1301 1.0911 1.0939 6.0001 1.0354 1.0350 1.0355 1.0656 1.0260 1.0864 1.1018 1.0966 1.0991 1.1000 1.1010 1.1005 1.0976 1.1055 1.1064
irintensity: 0.2066 6.3811 0.4626 2.6175 0.0923 12.8327 0.3917 0.5025 4.1910 1.3530 1.6610 0.6805 2.0665 9.9658 9.1497 3.7096 3.4413 9.2906 6.7365 7.7345 6.3288 11.1838 3.5172 1.1659 19.2814 47.8946 1.2663 13.6752 20.4140 4.6887 2.8375 25.0823 16.7364 1.9562 24.4133 95.0941 16.9700 1.0299 31.9918 9.5053 6.6785 17.1563 8.4933 14.5675 32.8845 59.3503 92.5924 18.2388 17.6644 3.9709 27.7881 2.7520 15.3314 8.5259 6.3814 33.2137 231.0850 56.2286 22.3991 19.7500 40.1997 6.7849 8.5764 32.0483 1.4357 12.0668 44.2014 29.8293 26.6960 0.8787 7.4419 3.6787
temp: 298.150 k
press: 1.00000 atm
elementType: 16 8 8 7 6 6 6 6 6 6 6 1 1 1 1 1 1 1 1 1 1 1 1 1 1 1
symmnumber: 1
zpe: 561145.6 jmol-1
zpe.correction: 0.213729 hartree
zpe.thermalcorrener: 0.228862 hartree
zpe.thermalcorrenthalpy: 0.229806 hartree
zpe.thermalcorrgfe: 0.170452 hartree
zpe.sumelectzpe: -878.024103 hartree
zpe.sumelectthermal: -878.008970 hartree
zpe.sumelectthermalent: -878.008026 hartree
zpe.sumelectthermalfe: -878.067380 hartree
dipole: 6.3506 1.2963 -1.0039
dipole: 6.5588
quadrupole: -81.7103 -82.5877 -69.6302
quadrupole: 8.5866 3.0919 1.7194
quadrupole: -3.7342 -4.6116 8.3459 8.5866 3.0919 1.7194
hfenergy: -878.2378321 hartree
pointgroup: C01 [X(C7H15N1O2S1)]
dipole: 2.4794623 -0.6876331 0.1950463 debye
dipolederiv: 0.9814698 -0.0012184 0.1383341 0.2381528 0.3089042 -0.0067847 0.10156 -0.0567839 0.5196146 -0.8000795 0.0763414 -0.002242 0.2990404 -0.924237 -0.1318335 0.1383485 -0.2294871 -0.3902803 -0.7078041 0.1239699 -0.0526936 -0.3500526 -0.4149785 -0.0917959 -0.0826165 0.0855552 -0.4820926 -1.1704525 0.3391238 0.0450626 0.1645346 -0.6341378 -0.0100118 -0.0729821 -0.0506096 -0.3253205 -0.2952834 -0.1429737 -0.0971545 -0.1162039 -0.0115785 -0.0466549 -0.2795252 -0.077252 0.0772155 1.6194572 -0.4293168 0.0077675 -0.3576557 0.8654683 0.1823142 0.2013254 0.299406 0.1072487 0.2165508 -0.1275076 -0.0538852 -0.2571909 0.5382439 0.0086853 -0.1241769 0.0244647 0.2486489 -0.0896927 -0.0531781 0.0698787 -0.0468569 0.0323785 -0.0577265 -0.0095133 0.0098658 -0.042117 0.261996 0.1385897 0.0378216 0.3240019 0.0835306 -0.0546419 0.0815491 -0.0644631 0.2288693 0.0619281 0.0180717 0.0108458 0.0606854 -0.0864554 0.0570575 0.0106888 0.0936559 -0.0354714 -0.1058761 -0.0206606 -0.0981928 0.0372085 -0.0309934 0.070871 -0.0433702 -0.0128447 -0.2209094 -0.0373936 0.0090375 0.0066901 0.0423089 -0.0838681 0.02934 0.0193305 0.0590397 -0.0099138 0.0320383 -0.0418556 -0.1389231 -0.0323034 -0.0080072 -0.0142191 -0.1015675 -0.0238853 -0.023636 -0.1385677 0.0268633 0.1313609 -0.0180537 0.0076541 0.0500326 0.0906604 0.0157802 0.0284783 -0.0220285 0.0770863 0.1186804 0.0576131 0.0737399 -0.0378068 0.126501 -0.0207254 -0.0221458 0.1137078 0.0221128 -0.0201768 0.0283876 -0.0863369 0.0738791 0.012843 -0.0060581 0.0823427 0.0144919 -0.0542759 -0.1106488 -0.0597995 0.0671341 -0.02243 -0.0366004 -0.0106141 0.1138974 -0.0531599 0.0017198 -0.0739043 0.0308697 0.0499907 0.1302118 -0.1388045 0.0801703 -0.0382105 0.1778478 0.0960364 0.0417607 -0.0184786 0.0109731 -0.0530373 0.0044942 -0.0356982 0.1069863 -0.0992453 -0.0681318 0.0676682 -0.0515321 0.1060296 -0.0036475 0.1364418 0.0482563 -0.0489288 -0.0223689 -0.0320378 -0.1127938 -0.0796306 0.0812208 -0.0560936 -0.1080345 -0.0108556 -0.0279353 -0.1011457 -0.0438254 0.1024324 -0.016936 0.0854429 0.0134521 0.0855229 0.0260127 0.0239562 0.0706269 0.0725776 0.0237118 0.103194 -0.1308658 -0.0663275 0.0284557 -0.0854691 0.0506094 0.0281334 -0.0743397 -0.0899746 -0.0560847 0.0441933 -0.001002 -0.0850281 -0.0174478 0.0410382 0.0736728 0.0761929 -0.0356271 0.0701295 -0.060235 0.0175958 -0.0223249 -0.0407531 0.0300026 -0.0088232 0.0115981 0.0842019 0.0046524 0.1167899 0.0205736 0.0668229 0.0007404 0.0080533 unknown
polarizability: 139.1945801|0.4226283|97.0698688|-1.2254567|3.4282365|105.2322315 unknown
InChI: InChI=1S/C7H15NO2S/c1-5-8(3)7(9)6(2)11(4)10/h6H,5H2,1-4H3
charge 0 multiplicity 1
26 atoms
S  -2.377289 0.353754 0.30834
O  0.155083 1.928662 0.399681
O  -3.381995 -0.870607 -0.241004
N  1.721406 0.270286 -0.099431
C  -0.690092 -0.097925 -0.640846
C  0.426254 0.772366 -0.07258
C  2.092478 -1.065327 -0.62236
C  -0.996802 0.141227 -2.12647
C  2.814925 1.09695 0.44729
C  2.210322 -2.143442 0.478504
C  -1.818679 -0.246907 2.047767
H  -0.590756 -1.175882 -0.424104
H  1.358453 -1.379347 -1.383011
H  3.062361 -0.960408 -1.145801
H  -0.181039 -0.240875 -2.768185
H  -1.122124 1.218011 -2.335387
H  -1.927031 -0.393491 -2.393793
H  3.322599 0.579486 1.282759
H  2.381606 2.039825 0.813823
H  3.56059 1.319036 -0.339225
H  2.957186 -1.859451 1.240631
H  1.242403 -2.297857 0.988448
H  2.523676 -3.10709 0.037435
H  -1.034952 0.429373 2.418295
H  -1.473953 -1.286392 1.938131
H  -2.72063 -0.203373 2.675293
