program: Gaussian 09
title: 000132085
version: EM64L-G09RevD.01
frameworkgroup: C1[X(C27H21Br2N3O7)]
method: RPBEPBE
basis: SDD
operation: Freq
keyword: #p
keyword: freq=noraman
keyword: PBEPBE/SDD
title: #p freq=noraman PBEPBE/SDD
converged: YES YES NO NO
title: Mulliken charges:
elementType: Br Br O O O O O O O N N N C C C C C C C C C C C C C C C C C C C C C C C C C C C H H H H H H H H H H H H H H H H H H H H H
charge: 0.079362 0.037996 -0.308176 -0.455105 -0.277354 -0.429485 -0.431360 -0.143213 -0.184722 0.005690 0.123537 0.047364 0.033920 -0.216620 -0.099917 -0.265043 -0.051298 -0.065928 -0.614207 0.277690 -0.233200 0.142126 -0.028524 -0.377992 -0.203921 -0.218714 0.357379 -0.218092 0.133563 0.210305 0.318532 -0.512760 -0.549283 -0.199881 -0.473488 -0.443437 0.122756 -0.644581 0.169561 0.248319 0.315874 0.208491 0.274812 0.192724 0.245071 0.263895 0.236678 0.183605 0.251562 0.289418 0.370416 0.340353 0.196295 0.248521 0.237866 0.366672 0.272870 0.267151 0.279834 0.296096
chargesum: 0.00000
title: Mulliken charges with hydrogens summed into heavy atoms:
elementType: Br Br O O O O O O O N N N C C C C C C C C C C C C C C C C C C C C C C C C C C C
charge: 0.079362 0.037996 -0.308176 -0.084690 -0.277354 -0.089133 -0.064688 -0.143213 -0.184722 0.005690 0.123537 0.047364 0.282239 0.099254 0.108574 0.009769 0.141425 0.179143 -0.113634 0.277690 -0.233200 0.142126 -0.028524 0.057175 0.085498 -0.218714 0.357379 -0.218092 0.133563 0.210305 0.318532 0.169921 -0.549283 -0.199881 -0.200618 -0.176287 0.122756 -0.068651 0.169561
polarizability: 8.28119242e+02 -6.02598386e+01 4.42420013e+02 9.67042327e+01 3.45285288e+01 2.54375906e+02
1716.lowfreq: -5.6089 -0.0001 0.0006 0.0007 2.4225 2.5539 7.2636 14.6356 18.8585
frequency: 7.0565 14.5001 18.7148 23.1518 36.1066 42.2055 46.9071 59.0396 68.4124 72.4787 78.3462 86.7299 92.9526 94.3076 107.9693 115.7506 126.7789 140.2236 157.0349 167.5030 168.4723 179.9484 193.5799 211.2530 223.8206 228.0119 237.9896 254.0483 261.3477 271.6621 285.6829 300.5236 305.8734 316.4617 327.0404 341.3450 346.0743 348.8230 365.6753 377.7109 393.3164 396.9574 423.6587 429.4353 430.4214 433.1953 440.5657 461.1686 472.3845 477.6570 487.7798 493.1200 505.9699 532.4302 541.0108 550.1904 574.3410 587.6402 608.1992 622.9902 638.1152 645.9107 658.5390 672.1840 681.9292 697.7453 706.9039 726.4760 758.1652 778.9507 805.4758 820.5841 824.8759 829.3468 849.3789 853.9274 863.5645 878.0587 885.3887 897.2100 899.0701 900.3343 920.0451 935.6902 940.2754 956.1962 968.1113 981.2633 1002.8574 1007.1751 1020.3318 1030.0111 1039.1089 1042.5932 1044.3800 1060.3136 1074.1792 1076.3209 1085.9000 1103.6828 1108.5839 1115.3971 1119.2488 1134.1553 1143.0335 1157.9534 1165.1615 1173.0582 1184.1814 1191.0228 1198.7399 1203.4416 1216.3769 1237.0811 1242.4859 1243.9682 1249.1232 1253.8143 1256.8107 1268.5152 1271.2155 1280.0627 1280.5375 1295.6389 1305.7577 1318.7498 1322.6739 1325.3905 1327.9920 1332.3851 1344.7685 1350.7309 1360.1522 1376.3672 1382.0459 1388.1909 1398.1280 1411.4929 1418.2978 1435.9163 1447.5370 1456.7220 1460.3588 1465.1386 1483.9665 1499.2143 1555.3364 1563.7592 1601.1159 1604.8315 1613.0162 1636.3098 1657.2921 2892.9209 2934.0333 2946.4752 2948.6389 2957.7978 2962.6622 2964.6859 2985.5104 3036.2365 3052.4370 3058.8099 3084.9121 3098.7192 3106.6577 3112.9655 3159.9592 3171.6743 3198.8591 3519.8653 3523.1319 3549.4902
redmass: 9.0401 6.9117 7.0157 12.6029 8.1998 7.7066 9.8737 8.6361 11.8438 3.4792 3.3723 5.0200 15.6719 4.4360 5.7492 7.1117 4.7240 7.0139 6.9424 3.1346 7.6894 3.6230 2.9781 2.8058 6.5204 4.6439 6.9931 4.1288 4.9221 4.2975 6.0975 5.4068 4.6564 4.6558 3.0782 1.6090 2.9848 7.9120 7.6842 4.8132 4.6364 3.1978 2.1384 5.0882 4.6659 4.0704 3.1853 4.0139 3.3270 5.4750 1.7891 4.1323 4.9422 5.3900 4.1584 4.6790 3.6267 4.1440 3.7084 4.6401 5.4345 7.1888 5.1916 4.5231 6.0427 4.6837 6.1141 7.4305 7.0182 6.4517 6.1464 3.4157 8.7977 2.0350 6.9904 2.9130 2.8299 4.0448 5.1442 4.1236 1.9486 1.7633 3.9259 2.9244 2.9045 4.6907 4.1048 4.5999 5.8093 6.0889 4.4999 2.4241 6.0148 3.5024 4.0979 2.7846 4.3161 4.1861 3.7243 4.4308 2.2400 2.9353 1.3962 5.2307 1.4840 1.4428 3.3510 1.2312 4.5600 1.1940 1.4217 1.3385 2.9461 2.6976 1.8543 1.1563 1.9720 1.7163 1.3298 1.3895 1.6588 3.4602 3.0650 1.4505 1.4592 1.9326 1.8384 1.4193 3.0199 1.3746 1.3076 1.3434 1.5155 1.2643 1.2240 1.5630 1.2964 3.9406 5.1558 1.1393 1.1252 1.0539 1.0793 7.5816 1.0527 10.2944 8.3972 8.8788 11.3192 10.6974 10.1219 10.7636 11.5288 1.0817 1.0808 1.0397 1.0682 1.0840 1.0719 1.0679 1.0836 1.0841 1.0954 1.0854 1.0906 1.0873 1.0929 1.1020 1.0932 1.0937 1.0959 1.0655 1.0658 1.0660
irintensity: 0.0468 0.3487 0.9953 0.5162 0.1585 0.6385 0.3654 0.4684 0.2501 10.0326 1.5692 0.5941 1.2368 3.7521 1.7065 2.6939 0.5429 3.5284 0.1116 2.3282 3.5030 1.9020 5.1250 3.8287 1.8605 2.5338 6.3090 18.6288 1.3215 11.3415 12.0357 4.0383 1.6249 7.0112 11.6507 35.5864 12.7686 11.9295 18.2708 13.1154 2.6111 6.6572 22.1892 8.4233 0.1651 36.3586 22.5170 22.6965 27.4994 28.5973 119.3016 8.4227 6.3833 7.4028 5.6690 3.4946 8.1122 16.5601 4.0567 22.4919 11.2910 3.7818 23.7697 1.2103 4.0456 0.0027 2.2379 8.8994 2.1528 51.8398 18.2572 18.9442 22.1286 12.9249 13.8647 14.3844 3.7361 8.1185 18.4012 57.9455 21.2286 45.0198 89.6832 59.9129 31.6841 53.4903 108.1599 40.6166 97.8278 33.7966 69.3353 17.9817 61.2142 48.0872 27.5294 74.8261 108.9813 62.7014 43.5755 19.6457 40.4620 12.3676 0.9779 79.3132 0.7080 13.0062 75.7987 12.4388 23.7087 43.8942 8.9230 6.4801 174.5426 110.0848 26.1619 47.9653 67.3179 61.2151 12.8063 14.0165 15.7187 43.5687 62.5760 13.1906 50.9608 114.6937 48.7489 1.6571 42.6970 19.0048 14.5556 18.0489 27.7197 4.9404 28.6153 15.2080 239.8799 291.8751 308.1424 4.1677 19.8768 7.9187 5.8673 30.3973 18.4149 36.0249 657.6866 259.8608 37.9314 281.3557 20.6968 6.9856 2.8598 21.7838 13.2805 40.7915 45.5842 39.0814 7.1076 2.5844 41.9622 1.0020 40.6558 9.9979 1.2328 7.3077 12.0397 21.2738 2.5514 2.7302 0.4342 35.9303 0.9025 15.2823
temp: 298.150 k
press: 1.00000 atm
elementType: 35 35 8 8 8 8 8 8 8 7 7 7 6 6 6 6 6 6 6 6 6 6 6 6 6 6 6 6 6 6 6 6 6 6 6 6 6 6 6 1 1 1 1 1 1 1 1 1 1 1 1 1 1 1 1 1 1 1 1 1
symmnumber: 1
zpe: 1128223.3 jmol-1
zpe.correction: 0.429718 hartree
zpe.thermalcorrener: 0.465125 hartree
zpe.thermalcorrenthalpy: 0.466069 hartree
zpe.thermalcorrgfe: 0.357695 hartree
zpe.sumelectzpe: -1756.299340 hartree
zpe.sumelectthermal: -1756.263933 hartree
zpe.sumelectthermalent: -1756.262988 hartree
zpe.sumelectthermalfe: -1756.371363 hartree
dipole: -5.7376 -5.7736 -0.7665
dipole: 8.1757
quadrupole: -268.1824 -263.9216 -245.9297
quadrupole: -5.7293 1.1243 -22.3702
quadrupole: -8.8379 -4.5770 13.4149 -5.7293 1.1243 -22.3702
hfenergy: -1756.7290574 hartree
pointgroup: C01 [X(C27H21Br2N3O7)]
dipole: 2.4010685 -2.1403578 -0.0071144 debye
polarizability: 796.6235157|56.3001949|453.4701008|160.1777446|23.9803796|274.8215445 unknown
InChI: InChI=1S/C27H21Br2N3O7/c1-38-26-16(7-33)39-25(23(36)24(26)37)9-4-10-14(5-13(9)28)31-22-18(10)19-12(6-30-27(19)29)17-11-2-8(34)3-15(35)20(11)32-21(17)22/h2,5-6,9,16,23-26,33,36-37H,3-4,7H2,1H3
charge 0 multiplicity 1
60 atoms
Br 4.398372 3.488447 2.684632
Br 1.200483 -3.548894 1.683744
O  2.899982 0.719253 -0.347754
O  5.53421 -1.048701 1.55965
O  4.818801 -0.447485 -3.302494
O  5.701516 -2.383733 -0.996539
O  1.715344 2.318551 -2.413195
O  -6.090498 3.025843 -0.726952
O  -7.734561 -1.406133 -1.279249
N  -0.54803 2.257057 1.036284
N  -3.446278 1.840177 -0.016447
N  -1.499547 -3.781209 0.821863
C  3.934796 0.557334 0.678814
C  3.304212 0.816333 2.077432
C  4.526255 -0.856167 0.5213
C  5.148643 -1.012951 -0.884188
C  4.157733 -0.648144 -2.015505
C  3.465689 0.709642 -1.718211
C  2.061629 -0.08573 2.368571
C  0.819779 0.408521 1.689764
C  2.942489 2.283036 2.202739
C  -0.361333 -0.155136 1.213177
C  0.65054 1.887239 1.543851
C  2.285744 0.997284 -2.652289
C  1.701108 2.799307 1.9174
C  -1.209544 1.030022 0.830195
C  -0.91437 -1.485497 1.029104
C  -2.506401 0.848511 0.359899
C  -3.061445 -0.510895 0.212503
C  -2.30232 -1.623624 0.531626
C  -4.422318 -0.302087 -0.312555
C  5.20213 -1.677757 -4.011707
C  -0.497597 -2.817924 1.163217
C  -4.547696 1.178254 -0.411686
C  -2.568339 -3.068728 0.450079
C  -5.446398 -1.166053 -0.624021
C  -5.817701 1.805819 -0.867585
C  -6.799247 0.835715 -1.54475
C  -6.731992 -0.643136 -1.143926
H  4.749338 1.298439 0.521255
H  4.0975 0.558891 2.802995
H  3.710504 -1.608204 0.623086
H  6.042354 -0.368232 -0.966267
H  3.380949 -1.449694 -2.09452
H  4.218702 1.521519 -1.805089
H  1.890709 -0.056153 3.465856
H  2.289595 -1.133905 2.129091
H  1.523261 0.196448 -2.530651
H  2.643213 1.005045 -3.693073
H  1.486661 3.871225 1.935722
H  6.104195 -1.814899 1.284299
H  4.94868 -3.028163 -1.068152
H  4.333631 -2.363238 -4.11044
H  6.028963 -2.199792 -3.497842
H  5.523472 -1.349631 -5.01251
H  1.387179 2.358677 -1.477746
H  -3.486286 -3.564074 0.132721
H  -5.383737 -2.250479 -0.485347
H  -6.578181 0.875813 -2.634409
H  -7.831842 1.205943 -1.430672
