program: Gaussian 09
title: 000132004
version: EM64L-G09RevD.01
frameworkgroup: C1[X(C11H14N2O2)]
method: RPBEPBE
basis: SDD
operation: Freq
keyword: #p
keyword: freq=noraman
keyword: PBEPBE/SDD
title: #p freq=noraman PBEPBE/SDD
converged: YES YES NO NO
title: Mulliken charges:
elementType: O O N N C C C C C C C C C C C H H H H H H H H H H H H H H
charge: -0.357420 -0.284205 -0.412204 -0.142881 -0.528732 0.281931 -0.399076 0.247580 -0.497810 -0.353339 0.399340 -0.393638 0.288299 -0.609096 -0.619057 0.236396 0.233165 0.223266 0.214275 0.278296 0.274113 0.227712 0.244186 0.222418 0.277170 0.223458 0.221276 0.221619 0.282957
chargesum: 0.00000
title: Mulliken charges with hydrogens summed into heavy atoms:
elementType: O O N N C C C C C C C C C C C
charge: -0.357420 -0.284205 -0.133908 -0.142881 -0.059172 0.281931 0.038466 0.247580 -0.223697 -0.125628 0.399340 -0.149452 0.288299 0.113950 0.106796
polarizability: 2.16784306e+02 -6.62783125e+00 1.33256214e+02 -5.06769956e+00 -6.64716638e+00 8.24668384e+01
1716.lowfreq: -5.5378 -4.0956 -0.0004 0.0000 0.0006 3.4321 22.6929 41.0615 71.7448
frequency: 22.4947 41.0485 71.7192 89.1844 123.0196 127.5891 133.5023 188.5885 205.6552 223.9157 242.2148 286.0543 344.9845 363.9742 416.0713 417.3373 427.5787 432.3579 539.0835 543.7866 604.4499 610.4622 676.3266 680.1190 712.8664 745.7713 786.1954 804.7711 814.1308 859.1749 883.2288 914.6741 923.2102 945.4924 992.6689 1045.5185 1058.0237 1058.5009 1090.7472 1098.9874 1127.6315 1132.4621 1149.2822 1165.2285 1168.4631 1210.0166 1249.2743 1252.3652 1281.1824 1290.5322 1303.6380 1361.2375 1369.6654 1419.8908 1431.0209 1434.9193 1446.5961 1458.4451 1472.0745 1477.4050 1483.2391 1487.7223 1499.3694 1505.2771 1609.3382 1631.3003 1659.9153 2935.5753 2962.2753 2968.5279 2984.7171 3031.3741 3038.5160 3047.1976 3066.7278 3123.0722 3137.4848 3150.4287 3165.4389 3179.5864 3571.3914
redmass: 3.8865 4.5412 3.4460 1.2549 2.8157 2.0113 1.3548 3.5778 2.9960 3.9963 2.7246 5.4121 4.1552 4.3433 2.7766 3.1058 2.5173 1.6871 6.0628 3.4206 5.0379 5.5862 2.7958 11.5346 4.6211 5.0255 3.7218 1.7940 3.0456 1.9530 1.4893 4.3411 1.3604 2.3992 2.9871 3.0467 1.3677 1.7883 2.0739 1.2183 2.5973 1.5813 1.3681 1.3766 1.2368 1.9046 3.8088 1.3836 2.0453 1.6015 1.4722 2.9591 3.1108 1.1597 1.3419 1.9310 3.6590 1.1630 1.0487 1.0439 1.7629 1.0451 1.1830 1.5299 7.0721 7.3748 8.4208 1.0704 1.0378 1.0375 1.0665 1.1012 1.1018 1.0924 1.0985 1.0968 1.0887 1.0946 1.0959 1.0932 1.0781
irintensity: 2.5658 4.3612 3.8882 0.7004 1.0226 0.7862 1.0985 6.3621 0.9581 1.6064 6.2127 0.3399 5.9112 25.6662 27.1506 9.1172 83.4529 119.2313 3.7497 3.6140 2.1149 8.3166 6.0060 14.3551 7.1303 2.2516 28.0391 62.7717 18.3733 3.2955 18.6375 12.8789 0.7876 2.4149 28.8313 5.8788 16.6417 7.7147 31.1844 0.0422 695.0537 149.1589 0.6744 27.0387 12.0326 111.0781 18.0017 4.7921 10.3790 0.8411 80.1645 15.9143 231.6833 30.2240 18.9156 15.1422 25.5068 12.0241 20.9349 0.5670 127.4358 35.8150 24.6317 74.8879 19.9246 29.6822 347.6265 120.0724 35.5674 154.3799 29.9652 54.5597 28.8861 57.9849 26.7121 2.2077 17.3038 2.7594 10.3066 1.1744 22.0677
temp: 298.150 k
press: 1.00000 atm
elementType: 8 8 7 7 6 6 6 6 6 6 6 6 6 6 6 1 1 1 1 1 1 1 1 1 1 1 1 1 1
symmnumber: 1
zpe: 615988.8 jmol-1
zpe.correction: 0.234618 hartree
zpe.thermalcorrener: 0.249341 hartree
zpe.thermalcorrenthalpy: 0.250285 hartree
zpe.thermalcorrgfe: 0.191604 hartree
zpe.sumelectzpe: -686.408991 hartree
zpe.sumelectthermal: -686.394267 hartree
zpe.sumelectthermalent: -686.393323 hartree
zpe.sumelectthermalfe: -686.452004 hartree
dipole: 0.1844 0.9906 0.4671
dipole: 1.1106
quadrupole: -55.9266 -84.8853 -91.3307
quadrupole: -3.9418 -6.3561 -5.1862
quadrupole: 21.4543 -7.5045 -13.9498 -3.9418 -6.3561 -5.1862
hfenergy: -686.6436083 hartree
pointgroup: C01 [X(C11H14N2O2)]
dipole: -0.0648767 -0.2863467 0.3236079 debye
polarizability: 216.9710397|-2.0542197|129.948632|7.2338|-13.7767166|85.5876861 unknown
InChI: InChI=1S/C11H14N2O2/c1-13(2)11(14)15-9-3-4-10-8(7-9)5-6-12-10/h3-4,7,12H,5-6H2,1-2H3
charge 0 multiplicity 1
29 atoms
O  1.604518 -0.402055 0.47276
O  1.978369 1.142084 -1.288147
N  -4.002782 -0.511679 0.091913
N  3.746128 0.281028 -0.004258
C  -3.0645 1.682462 -0.116125
C  -1.979028 0.621511 0.039578
C  -4.340946 0.838071 -0.435969
C  -2.604885 -0.652223 0.173335
C  -0.586935 0.753646 0.1113
C  -1.834172 -1.817513 0.382556
C  0.181574 -0.423276 0.303986
C  -0.425011 -1.687801 0.441037
C  2.417691 0.411579 -0.36249
C  4.754376 1.040718 -0.758078
C  4.236922 -0.583849 1.078601
H  -3.195685 2.239351 0.832392
H  -2.848188 2.419195 -0.908226
H  -5.246239 1.24249 0.049171
H  -4.516872 0.806456 -1.533651
H  -4.599884 -1.309839 -0.122866
H  -0.096999 1.723069 -0.004426
H  -2.301383 -2.801914 0.492497
H  0.21101 -2.565595 0.591981
H  5.313798 1.718142 -0.084079
H  4.246536 1.636529 -1.530814
H  5.474783 0.354165 -1.24379
H  4.788967 0.01706 1.827677
H  4.924966 -1.35325 0.675776
H  3.391373 -1.079863 1.570957
