program: Gaussian 09
title: 000131989
version: EM64L-G09RevD.01
frameworkgroup: C1[X(C11H7N3O)]
method: RPBEPBE
basis: SDD
operation: Freq
keyword: #p
keyword: freq=noraman
keyword: PBEPBE/SDD
title: #p freq=noraman PBEPBE/SDD
converged: YES YES NO NO
title: Mulliken charges:
elementType: O N N N C C C C C C C C C C C H H H H H H H
charge: -0.220671 -0.344641 0.003296 -0.002723 0.358689 0.349186 -0.369429 -0.326588 0.207208 -0.328213 -0.333799 0.045747 -0.343109 -0.335310 -0.220840 0.276086 0.274547 0.350573 0.238081 0.229460 0.246965 0.245486
chargesum: 0.00000
title: Mulliken charges with hydrogens summed into heavy atoms:
elementType: O N N N C C C C C C C C C C C
charge: -0.220671 0.005932 0.003296 -0.002723 0.358689 0.349186 -0.093343 -0.052041 0.207208 -0.090133 -0.104338 0.045747 -0.096144 -0.089824 -0.220840
polarizability: 2.38048766e+02 6.89775600e+00 1.48260862e+02 -1.10708522e+00 -5.40154730e+00 6.22521071e+01
1716.lowfreq: -9.3991 -8.3109 -1.6182 -0.0006 -0.0005 0.0002 46.7715 66.9089 86.7332
frequency: 46.7434 66.9054 86.7325 120.0998 147.5629 189.3352 277.7635 294.3752 353.2149 367.6247 376.3273 414.7382 462.2442 482.1077 529.0396 579.4400 593.1130 617.7863 661.8896 678.8880 739.5107 747.7527 763.4302 786.1108 825.7766 875.3784 898.1549 903.9017 943.7259 961.8305 963.0753 975.0444 1043.7216 1057.8013 1066.9387 1092.6071 1198.9714 1226.6786 1245.7259 1290.3439 1307.4752 1327.8165 1339.7916 1384.6307 1409.2076 1433.5790 1472.2467 1534.4138 1549.7495 1584.8019 1610.1042 1655.0787 2184.5350 3130.6386 3134.6124 3151.5826 3153.5559 3160.4502 3170.1011 3506.6358
redmass: 4.3241 8.4912 7.8233 5.6506 8.1850 7.8064 8.3827 7.2772 7.1670 2.5646 4.3726 6.0284 8.0549 3.8282 4.2751 7.7570 5.8882 3.8048 6.9025 7.3853 2.0619 3.0713 5.8783 2.3292 1.4780 1.2629 4.4234 1.7025 1.5035 4.4044 1.4331 1.5504 3.0487 3.8397 2.4663 1.6391 2.5750 1.2656 1.6361 3.4324 3.0522 1.8160 1.7157 2.5573 2.1542 2.5361 2.1652 5.7307 7.3577 5.4401 4.4126 7.0988 12.6279 1.0873 1.0881 1.0947 1.0946 1.0982 1.0941 1.0780
irintensity: 0.9765 6.6258 5.0211 0.8719 0.7007 1.3375 0.1703 2.8922 1.9320 0.2339 1.0319 1.8653 8.3675 25.6830 9.3916 11.6128 13.3952 5.1751 1.4780 7.2193 24.4481 2.5329 1.2415 97.6810 58.8427 0.1175 10.7301 1.5851 11.1456 2.1407 0.4266 0.9250 2.9853 3.7575 16.4378 0.4677 3.4618 0.5110 89.2614 10.3314 26.3602 7.1141 5.3647 3.3699 15.8147 5.4282 14.1385 15.5843 48.3159 176.8147 32.6633 470.8381 14.5567 9.7738 13.0615 17.1057 19.6857 3.7310 1.6059 78.7108
temp: 298.150 k
press: 1.00000 atm
elementType: 8 7 7 7 6 6 6 6 6 6 6 6 6 6 6 1 1 1 1 1 1 1
symmnumber: 1
zpe: 413629.3 jmol-1
zpe.correction: 0.157543 hartree
zpe.thermalcorrener: 0.169356 hartree
zpe.thermalcorrenthalpy: 0.170301 hartree
zpe.thermalcorrgfe: 0.118544 hartree
zpe.sumelectzpe: -661.818087 hartree
zpe.sumelectthermal: -661.806274 hartree
zpe.sumelectthermalent: -661.805330 hartree
zpe.sumelectthermalfe: -661.857086 hartree
dipole: -4.4343 -4.2661 -0.6362
dipole: 6.1860
quadrupole: -133.7231 -76.1727 -86.6521
quadrupole: -6.4055 -1.8778 -2.8719
quadrupole: -34.8738 22.6766 12.1972 -6.4055 -1.8778 -2.8719
hfenergy: -661.9756302 hartree
pointgroup: C01 [X(C11H7N3O1)]
dipole: 1.7915852 -1.6324326 0.2204554 debye
dipolederiv: -1.3670159 -0.3809547 0.0435043 -0.414773 -0.4770122 0.0183221 0.0494641 0.0172568 -0.3504483 -0.9599418 -0.6764442 0.0798245 0.3561359 -0.2140646 -0.0017 -0.0633456 -0.0191056 -0.2570706 -0.5223333 -0.0243578 0.0130793 -0.0353769 -0.3343882 -0.0521387 0.0112026 -0.0419966 -0.26908 -0.2481593 0.0585511 -0.0088705 0.1009078 -0.2913849 0.0107719 -0.0144767 0.0075184 -0.2347191 -0.2518836 -0.0144206 0.0059865 0.2780383 -0.5591714 0.0546152 -0.0027205 0.0707014 -0.0753653 0.8434261 0.1316133 -0.0339185 0.22624 0.1297697 0.0595063 -0.0739258 0.0178037 0.0519096 0.6209195 -0.2173294 0.029427 -0.2350457 0.2068318 -0.0518875 -0.0683921 -0.0437472 -0.0499619 0.293065 0.7547004 -0.085011 0.105195 0.4845135 -0.0825392 0.0958715 -0.0496913 -0.0006091 -0.5168772 0.0929103 -0.0167831 -0.5464699 -0.0450987 0.0170917 0.0731061 0.0082005 0.0660551 -0.4033957 -0.2221607 -0.0842783 -0.2475029 -0.1522386 0.0178958 -0.0507751 0.0179611 -0.0823268 -0.5368377 0.091302 0.087246 0.063647 -0.0278276 0.0541055 0.0682007 0.0397089 -0.0885551 1.754864 0.5142863 -0.0574652 0.3215908 0.4382182 -0.0338388 -0.0351093 -0.0290362 0.2078144 0.3227919 0.2106063 0.0491637 0.090102 0.2704755 0.1432329 0.0201175 0.1425724 -0.0077458 0.409724 -0.1589908 -0.1102715 -0.0212106 0.1721825 0.1120624 -0.085572 0.1274651 -0.0009749 0.0959288 -0.1969219 0.027886 -0.1705448 0.1404923 -0.0152222 0.031065 -0.0083615 0.0451179 0.1226004 -0.0610374 0.0067094 -0.0433113 -0.0081537 0.0232624 0.0197022 0.0114371 0.1397115 0.0406997 0.065851 -0.0094964 0.0734346 0.0535925 0.021596 -0.0207019 0.0151725 0.1610653 0.1374641 0.0013432 0.0013851 0.0521935 0.2638111 0.0083803 -0.0218416 0.0055538 0.3261609 0.024691 0.095373 0.0620566 0.0841143 0.0384899 -0.0625155 0.068332 -0.0596426 0.112192 0.082187 -0.0946833 -0.0344447 -0.0638035 -0.0294514 -0.087653 -0.0356187 -0.0742074 0.1084494 0.0582364 -0.0535054 -0.016711 -0.0556817 -0.0562809 -0.0817463 -0.0239754 -0.0836038 0.1010458 -0.0001533 0.0842691 0.0509817 0.082121 -0.0033049 -0.0716012 0.0593931 -0.0719595 0.097335 unknown
polarizability: 238.3480579|-4.3437532|147.7862831|-2.0865313|6.5414214|62.4273938 unknown
InChI: InChI=1S/C11H7N3O/c12-6-9-5-10(7-14-11(9)15)8-1-3-13-4-2-8/h1-5,7,14H
charge 0 multiplicity 1
22 atoms
O  -3.888174 -1.354268 0.152808
N  -1.627006 -1.941214 0.226008
N  4.451525 0.529424 -0.036029
N  -3.936675 2.337114 -0.305428
C  0.184226 -0.360844 0.036238
C  1.637669 -0.059115 0.006467
C  -0.809107 0.670737 -0.086037
C  -0.282476 -1.66823 0.195109
C  -2.179214 0.397524 -0.056088
C  2.147722 1.173892 0.496562
C  2.584938 -0.984808 -0.511314
C  -2.684343 -0.977891 0.107723
C  3.536622 1.420416 0.451382
C  3.956765 -0.655634 -0.505056
C  -3.143707 1.449241 -0.194001
H  -0.487143 1.707092 -0.232692
H  0.392987 -2.517205 0.330612
H  -1.958075 -2.90337 0.357508
H  1.484085 1.926662 0.934409
H  2.264603 -1.937444 -0.94704
H  3.946051 2.365236 0.825641
H  4.699529 -1.357714 -0.90008
