program: Gaussian 09
title: 000131944
version: EM64L-G09RevD.01
frameworkgroup: C1[X(C18H28O8)]
method: RPBEPBE
basis: SDD
operation: Freq
keyword: #pfreq=noraman
keyword: PBEPBE/SDD
title: #p freq=noraman PBEPBE/SDD
converged: YES YES NO NO
title: Mulliken charges:
elementType: O O O O O O O O C C C C C C C C C C C C C C C C C C H H H H H H H H H H H H H H H H H H H H H H H H H H H H
charge: -0.207943 -0.212212 -0.449472 -0.406641 -0.205242 -0.415148 -0.164148 -0.217504 0.105883 0.058602 -0.512057 -0.010984 -0.246440 0.228324 -0.429171 0.156357 -0.377922 0.155069 -0.389101 -0.388638 -0.385269 -0.382506 -0.372821 -0.353580 -0.356598 -0.696353 0.287748 0.250266 0.258583 0.309383 0.213324 0.221631 0.194251 0.231825 0.385529 0.193341 0.199143 0.196439 0.198824 0.371253 0.194009 0.193680 0.193170 0.193112 0.410292 0.189489 0.189601 0.188244 0.187956 0.194949 0.194519 0.215287 0.209648 0.210019
chargesum: 0.00000
title: Mulliken charges with hydrogens summed into heavy atoms:
elementType: O O O O O O O O C C C C C C C C C C C C C C C C C C
charge: -0.207943 -0.212212 -0.063942 -0.035388 -0.205242 -0.004856 -0.164148 -0.217504 0.105883 0.058602 0.025957 0.247599 0.062942 0.228324 0.005784 0.156357 0.048154 0.155069 0.003384 0.006625 0.002419 0.003776 0.006269 0.022620 0.032871 -0.061399
polarizability: 2.86837042e+02 2.17389601e-02 1.93639868e+02 8.58458412e+00 1.72052793e+00 1.80801258e+02
1716.lowfreq: -4.8911 -0.0017 0.0010 0.0013 2.6457 6.2192 12.5472 17.5484 32.3674
frequency: 12.3069 16.8805 32.3060 43.3958 47.4276 58.2292 72.3579 77.6028 83.5358 91.6098 103.4652 109.4250 119.2901 120.8549 138.7431 139.7544 152.4882 157.2367 162.5754 163.9518 192.5219 225.5966 230.7512 237.6820 239.8029 247.6281 286.5610 315.8269 323.6475 327.7410 342.4064 368.5804 381.5672 412.7118 414.8943 438.0879 451.2701 478.5440 490.3891 501.4924 507.4379 569.8582 577.3569 587.5883 617.4655 626.5434 646.0789 692.4272 721.9065 723.7763 727.0298 731.2516 739.5709 750.1366 784.1473 810.3420 833.7287 850.9276 867.6306 886.1295 887.4484 902.2382 947.3085 970.7736 983.7873 988.3605 1005.8025 1014.7119 1021.0678 1024.5148 1035.0904 1042.9071 1055.2327 1057.8432 1073.2153 1078.1579 1080.5608 1081.5487 1084.4356 1087.6469 1114.8784 1126.4725 1141.7930 1148.0082 1160.1163 1183.7390 1198.6439 1210.7219 1212.1600 1216.8457 1240.8574 1242.5843 1259.1775 1266.2088 1267.4878 1278.9405 1285.6832 1288.0649 1288.6566 1295.8552 1296.8211 1304.4086 1308.5672 1312.2870 1326.8213 1344.2740 1354.5442 1356.5758 1360.1786 1369.6418 1373.0832 1379.0535 1388.5067 1440.9821 1449.2712 1460.9091 1461.3273 1464.4985 1465.5074 1470.6971 1475.9670 1476.6756 1481.7515 1486.4648 1489.2033 1655.5093 1688.3658 1723.9781 2949.1248 2949.6306 2951.7009 2952.4000 2957.2208 2963.0373 2967.6437 2968.6531 2971.7703 2972.9870 2983.5159 2987.5910 2993.8662 3002.9969 3014.7830 3019.0272 3028.6083 3029.9675 3036.0229 3039.4836 3041.6689 3054.0061 3068.3964 3070.5004 3102.4919 3452.1511 3538.1367 3546.3984
redmass: 6.0508 5.1061 4.6235 3.5178 1.7196 5.7865 5.7217 2.0037 2.8747 5.0157 4.9918 3.4048 2.8816 2.6317 4.8741 3.4620 2.0960 2.3331 4.2595 3.6816 6.3967 1.1427 7.8023 3.3345 3.9345 4.4938 3.8347 4.9296 2.7809 2.2809 2.9641 3.2316 3.3785 1.8035 2.9185 5.2980 3.1736 3.0945 3.4964 3.1570 1.9652 4.7140 6.0275 5.3957 4.3003 3.9892 4.7490 5.8436 1.0599 1.0894 4.9603 1.1580 4.5139 1.1788 1.3418 3.1655 1.7480 2.4022 7.7894 2.9772 1.9041 1.5749 1.7173 1.7952 4.3128 4.0874 3.9161 2.0936 2.2305 4.0078 2.2751 2.8024 3.0826 4.3559 2.4630 2.2997 2.2728 2.2055 2.7223 2.8853 2.5649 3.1112 2.8292 3.1749 2.5265 1.8234 1.4322 1.4595 1.5549 1.4401 1.3172 1.3512 1.4925 1.3121 1.2717 1.0210 1.1802 1.1712 1.2300 1.0920 1.1551 1.6379 1.3870 1.3313 1.4193 1.4581 1.6331 1.6478 1.6315 1.4436 1.5445 1.5362 1.2178 1.0888 1.0839 1.0734 1.0743 1.0654 1.0741 1.0807 1.0627 1.0607 1.0863 1.0923 1.0958 10.1534 12.7068 12.9092 1.0589 1.0586 1.0592 1.0593 1.0595 1.0594 1.0612 1.0591 1.0365 1.0632 1.0962 1.0972 1.0989 1.1014 1.0992 1.0977 1.0872 1.0757 1.0946 1.0829 1.1033 1.1024 1.1007 1.0992 1.1039 1.0653 1.0647 1.0658
irintensity: 0.0400 0.1145 0.1612 0.0462 0.0351 6.5397 2.7153 0.2368 0.8978 0.9094 0.2582 3.6334 2.4412 0.1122 0.7956 2.8857 0.3573 1.1012 1.5752 0.5407 3.6599 0.0162 1.9088 3.3100 6.9928 16.7172 29.8143 2.5385 29.2579 57.5317 59.8701 22.3988 18.8565 44.8074 4.1491 11.3357 1.4419 3.3056 10.4211 2.3653 34.5993 7.7117 39.1033 1.4519 43.9599 56.5125 36.7372 8.0702 18.7476 0.3356 9.0513 3.7315 26.4928 1.5251 2.6534 13.5561 3.5003 12.5591 26.7965 11.2310 6.1050 29.8715 54.0374 19.4383 6.5316 66.8414 59.7861 130.9844 29.3302 51.1950 18.3575 276.0071 2.7478 209.0794 0.3615 52.5786 4.2385 5.6107 12.2737 47.1014 17.2002 7.4592 62.7529 94.6038 12.0310 2.5699 45.5401 15.5935 7.5728 4.0819 0.4390 0.0547 23.7777 1.1871 1.1906 0.6439 1.2958 4.8748 0.6427 0.7362 4.8503 39.0662 16.3155 3.1333 6.3342 5.7072 4.2691 1.6078 2.1238 18.6886 23.3548 20.5080 11.2899 2.6635 13.8444 0.0525 0.1617 0.0365 0.1758 0.8352 6.6660 7.0300 2.9574 2.2373 36.1141 217.7717 299.4008 330.0770 0.0851 0.3311 4.3416 0.6008 0.3377 41.1668 6.7233 162.6604 38.1842 84.4962 0.7818 1.9007 2.3774 1.3888 2.9479 1.5583 2.5358 1.9943 25.5415 6.2588 127.1205 127.5585 99.0559 55.7410 7.6518 70.1633 76.7530 22.5678
temp: 298.150 k
press: 1.00000 atm
elementType: 8 8 8 8 8 8 8 8 6 6 6 6 6 6 6 6 6 6 6 6 6 6 6 6 6 6 1 1 1 1 1 1 1 1 1 1 1 1 1 1 1 1 1 1 1 1 1 1 1 1 1 1 1 1
symmnumber: 1
zpe: 1158533.5 jmol-1
zpe.correction: 0.441262 hartree
zpe.thermalcorrener: 0.470143 hartree
zpe.thermalcorrenthalpy: 0.471087 hartree
zpe.thermalcorrgfe: 0.378685 hartree
zpe.sumelectzpe: -1302.462277 hartree
zpe.sumelectthermal: -1302.433396 hartree
zpe.sumelectthermalent: -1302.432452 hartree
zpe.sumelectthermalfe: -1302.524854 hartree
dipole: 2.5792 -0.4878 2.0439
dipole: 3.3269
quadrupole: -166.3368 -164.2066 -161.7718
quadrupole: -13.4608 3.8050 -6.0302
quadrupole: -2.2317 -0.1016 2.3333 -13.4608 3.8050 -6.0302
hfenergy: -1302.9035395 hartree
pointgroup: C01 [X(C18H28O8)]
dipole: 1.0155199 0.2568195 -0.784819 debye
polarizability: 286.8577064|0.753008|193.2831151|-8.424186|2.7185589|181.1373463 unknown
InChI: InChI=1S/C18H28O8/c1-2-3-4-5-6-7-8-9-10-12-11-17(16(23)25-12)18(24,15(21)22)13(19)14(20)26-17/h12-13,19,21,24H,2-11H2,1H3
charge 0 multiplicity 1
54 atoms
O  -3.704777 1.13079 1.023491
O  -0.990296 -0.491009 0.771408
O  -4.063736 -0.714351 -2.120349
O  -6.798999 0.54972 -0.809261
O  -2.744468 -1.907363 1.328189
O  -5.660032 -1.321844 1.100902
O  -5.707354 2.260394 1.367012
O  -5.076803 -2.743596 -0.654444
C  -3.157825 0.173413 -0.001557
C  -4.415296 -0.382589 -0.762278
C  -2.109629 0.889742 -0.862662
C  -0.822661 0.806552 -0.008223
C  -5.39539 0.837609 -0.673367
C  -2.324397 -0.872771 0.784007
C  0.488831 0.725923 -0.785698
C  -5.019945 1.516067 0.662062
C  1.741079 0.675691 0.117443
C  -5.043366 -1.627577 -0.098367
C  3.047979 0.501029 -0.687038
C  4.306766 0.45854 0.208058
C  5.611079 0.213459 -0.583389
C  6.869836 0.1693 0.311891
C  8.170396 -0.111198 -0.474477
C  9.429581 -0.158043 0.420164
C  10.728444 -0.449353 -0.366045
C  11.981417 -0.496052 0.535059
H  -1.988544 0.338281 -1.811328
H  -2.390495 1.931755 -1.086237
H  -0.79528 1.603743 0.757512
H  -5.145601 1.504638 -1.518815
H  0.540382 1.610879 -1.453602
H  0.456883 -0.167407 -1.440541
H  1.799216 1.605543 0.720732
H  1.634012 -0.160528 0.835087
H  -4.32981 -1.661156 -2.288685
H  3.147973 1.326986 -1.422592
H  2.989302 -0.436962 -1.27775
H  4.391036 1.411981 0.770303
H  4.186139 -0.340727 0.968781
H  -7.163453 0.268775 0.069941
H  5.525195 -0.743313 -1.140069
H  5.733434 1.008168 -1.349103
H  6.737711 -0.611442 1.090107
H  6.969381 1.13318 0.853735
H  -5.94631 -2.146282 1.577215
H  8.303866 0.668083 -1.254132
H  8.06964 -1.076024 -1.014704
H  9.295115 -0.933478 1.203387
H  9.536481 0.808411 0.956213
H  10.620385 -1.4147 -0.901801
H  10.861916 0.326032 -1.14813
H  12.895753 -0.704548 -0.050609
H  12.128187 0.467094 1.059624
H  11.885952 -1.284866 1.305132
