program: Gaussian 09
title: 000131941
version: EM64L-G09RevD.01
frameworkgroup: C1[X(C16H28N2O11)]
method: RPBEPBE
basis: SDD
operation: Freq
keyword: #p
keyword: freq=noraman
keyword: PBEPBE/SDD
title: #p freq=noraman PBEPBE/SDD
converged: YES YES NO NO
title: Mulliken charges:
elementType: O O O O O O O O O O O N N C C C C C C C C C C C C C C C C H H H H H H H H H H H H H H H H H H H H H H H H H H H H
charge: -0.286221 -0.251273 -0.424161 -0.479248 -0.446272 -0.452140 -0.433340 -0.469761 -0.291012 -0.213972 -0.359651 -0.367345 -0.339210 -0.095412 -0.165311 -0.015669 -0.181897 0.018153 -0.007269 -0.215771 -0.402799 -0.032962 -0.173355 -0.415089 0.294078 -0.085988 -0.787280 0.324360 -0.808453 0.281384 0.210447 0.183778 0.235225 0.221445 0.227236 0.223918 0.288780 0.209905 0.226948 0.196633 0.343598 0.363249 0.384933 0.261042 0.193740 0.364326 0.352462 0.348529 0.354697 0.214959 0.261600 0.253217 0.208703 0.355757 0.214506 0.243522 0.339734
chargesum: 0.00000
title: Mulliken charges with hydrogens summed into heavy atoms:
elementType: O O O O O O O O O O O N N C C C C C C C C C C C C C C C C
charge: -0.286221 -0.251273 -0.060913 -0.094316 -0.081945 -0.103611 -0.078643 -0.114003 -0.291012 -0.213972 -0.359651 -0.078565 0.013252 0.185971 0.045136 0.168109 0.053328 0.239598 0.219967 0.008146 0.034054 0.163671 0.170243 0.039693 0.294078 0.128971 -0.063760 0.324360 -0.010690
polarizability: 2.45368543e+02 2.53421143e+00 2.31849349e+02 2.31307002e+00 6.73438150e+00 2.01534447e+02
1716.lowfreq: -8.6594 -5.5334 -0.0003 0.0004 0.0005 4.1384 8.0654 23.7786 29.3306
frequency: -4.2956 23.6984 29.3068 45.3411 47.6405 57.4409 62.5795 66.1012 72.6413 76.3279 87.4920 101.5449 106.8284 115.6540 123.7643 138.5769 139.1976 154.1308 155.8352 168.8713 180.1622 188.2393 195.9802 204.3216 223.7199 238.1862 243.4738 249.1324 257.2516 263.5975 266.6123 281.1746 287.3855 295.2387 303.2244 337.1187 348.9003 392.5275 399.5609 410.6149 421.5995 421.7936 454.0484 457.4484 491.9181 506.6095 521.0100 534.3123 552.5592 563.4519 566.6175 587.5871 598.1848 603.6644 618.2155 635.5409 686.8529 706.3061 711.8526 761.2858 776.8743 803.4551 808.3187 830.3788 845.0681 861.7046 869.9757 896.4238 922.5204 943.6975 946.4614 951.8113 956.5230 975.1878 979.5014 990.4679 992.5700 997.9466 1006.4570 1019.1664 1035.2233 1042.8758 1044.8644 1059.3314 1059.8895 1067.7307 1092.3594 1095.3089 1098.6964 1101.7282 1115.5054 1126.3861 1141.8618 1200.2793 1202.4116 1210.1518 1219.0832 1228.1856 1230.5970 1233.4238 1249.2391 1253.9365 1259.5627 1262.1818 1266.4530 1269.5731 1282.8537 1293.4467 1299.0464 1305.0003 1320.3061 1324.9406 1336.7532 1343.3147 1346.2612 1357.0250 1359.7008 1363.7636 1371.3985 1380.3702 1383.8666 1384.6065 1394.7210 1407.1831 1410.6744 1420.6425 1447.8794 1461.2601 1462.8621 1465.6093 1468.6326 1471.6873 1485.1780 1492.3339 1577.7176 1610.1243 1624.0421 2859.0431 2913.3049 2935.8919 2941.3526 2954.0774 2958.5863 2960.7581 2964.9658 2986.0465 2995.0482 2995.5117 3005.2160 3027.3372 3034.3616 3050.4526 3063.7265 3069.0874 3089.3780 3113.1088 3118.1455 3141.4547 3447.9191 3466.5075 3497.3316 3509.5893 3550.7765 3575.7256 3591.7262
redmass: 5.8494 5.1393 5.4380 4.7365 5.0426 6.1749 6.5088 4.1774 1.3450 4.7589 3.7111 7.1222 3.5787 5.0044 3.9065 5.2077 5.3882 4.8728 4.6781 5.5765 1.0705 5.0518 4.4061 4.2638 3.1958 1.4794 3.8550 4.8793 4.6831 1.2444 4.7898 5.1666 5.3279 4.3109 6.0754 4.9728 3.4761 4.1682 4.8751 4.5883 3.6663 1.0932 3.2660 3.3839 3.4494 1.8083 1.8671 1.7277 3.0397 1.7286 1.4477 4.3955 3.3510 3.6833 4.0096 4.1148 4.1520 2.1646 1.7311 4.4725 4.6220 1.0714 3.8967 4.1609 3.0125 2.9017 2.5377 4.8029 2.8943 4.7996 3.7033 5.4434 4.7927 3.5195 2.3916 2.0917 1.8189 3.5228 2.1726 2.9259 2.5016 1.6986 2.1259 2.2186 1.9802 3.1664 3.4368 3.7032 2.6033 3.5981 2.1716 3.1987 3.0858 1.3367 1.1470 1.2509 1.1143 1.2886 1.3460 1.3006 1.4490 1.2665 1.1533 1.3418 1.4716 1.2873 1.2273 1.5064 1.4495 1.3749 1.4329 1.3558 1.3051 1.3254 1.3557 1.3089 1.2845 1.1773 1.3298 1.3288 1.2366 1.2615 1.4772 1.2335 1.5261 1.5250 1.0698 1.3410 1.0803 1.1601 1.0833 1.0778 1.4351 1.9118 5.6890 7.4391 6.2994 1.0818 1.0824 1.0882 1.0824 1.0819 1.0451 1.0611 1.0580 1.0838 1.0405 1.0799 1.0831 1.0952 1.0957 1.1034 1.0896 1.0827 1.0992 1.0989 1.0996 1.0729 1.0644 1.0651 1.0778 1.0649 1.0774 1.0666 1.0669
irintensity: 0.6193 0.3757 0.2852 0.4337 4.6412 0.9607 10.4352 11.9647 0.8740 3.8256 2.6612 0.7996 0.9430 4.5639 15.6822 3.3560 4.4926 7.2501 23.3034 14.5019 0.2008 7.6344 5.1911 0.4561 2.9487 114.3041 47.0598 13.7629 8.1426 129.1122 8.3476 4.1784 1.2922 12.2738 3.4285 4.0932 4.4412 5.0517 18.1293 10.9514 24.9110 139.0719 27.4690 4.3740 45.7136 26.6098 23.6414 80.7719 32.7133 132.3533 25.5403 8.7167 4.3610 16.0209 2.7865 28.2854 3.0602 74.9892 86.7427 35.9825 59.7717 151.6148 3.2465 41.8455 7.9267 17.6910 6.1284 54.2624 43.7864 11.7961 63.6307 74.6001 117.4613 27.2385 9.4837 5.5139 26.2670 35.1620 23.8746 132.6600 72.6713 6.2679 44.9415 34.0993 3.6693 37.3503 27.1456 27.0702 40.2877 17.7541 15.7322 18.7445 9.1071 30.4484 25.5357 27.8507 39.3820 37.9332 22.1715 5.6547 33.3794 70.1726 13.5894 7.2649 14.7387 18.7390 22.2611 12.1008 46.1450 76.3182 6.1498 20.5411 0.1997 9.5494 38.0992 10.1765 2.0584 36.3538 0.0785 26.1695 27.4146 89.0494 18.1809 56.7274 16.1407 0.4807 29.2916 155.5113 10.1292 84.9871 26.3728 6.3403 30.1167 232.8132 291.1425 141.6914 213.0408 65.3957 50.3537 63.8978 30.0975 5.6945 92.6697 45.6048 40.1208 36.4312 4.9504 42.6925 55.1164 9.8127 152.0935 22.1399 23.2204 7.1532 16.2303 10.9371 13.8849 713.5519 26.4745 27.0084 61.2768 18.3925 12.4915 3.8364 8.3644
temp: 298.150 k
press: 1.00000 atm
elementType: 8 8 8 8 8 8 8 8 8 8 8 7 7 6 6 6 6 6 6 6 6 6 6 6 6 6 6 6 6 1 1 1 1 1 1 1 1 1 1 1 1 1 1 1 1 1 1 1 1 1 1 1 1 1 1 1 1
symmnumber: 1
zpe: 1188796.4 jmol-1
zpe.correction: 0.452789 hartree
zpe.thermalcorrener: 0.484512 hartree
zpe.thermalcorrenthalpy: 0.485456 hartree
zpe.thermalcorrgfe: 0.390023 hartree
zpe.sumelectzpe: -1561.107465 hartree
zpe.sumelectthermal: -1561.075742 hartree
zpe.sumelectthermalent: -1561.074798 hartree
zpe.sumelectthermalfe: -1561.170231 hartree
dipole: -3.7725 -1.2256 -4.3585
dipole: 5.8933
quadrupole: -172.1684 -162.1173 -165.6913
quadrupole: -5.6226 -1.1433 -1.6621
quadrupole: -5.5094 4.5417 0.9677 -5.6226 -1.1433 -1.6621
hfenergy: -1561.5602539 hartree
pointgroup: C01 [X(C16H28N2O11)]
dipole: -0.9753484 0.501017 -2.0429422 debye
polarizability: 239.7777901|-7.0256705|226.0016215|14.1695065|11.4535017|212.9729267 unknown
InChI: InChI=1S/C16H28N2O11/c1-6(22)17-8(3-19)12(25)15(9(24)4-20)29-16-11(18-7(2)23)14(27)13(26)10(5-21)28-16/h3,8-18,20-21,24-27H,4-5H2,1-2H3
charge 0 multiplicity 1
57 atoms
O  0.916602 -0.904427 -1.273723
O  -0.208001 0.842552 -0.206508
O  4.412392 -0.106381 0.983653
O  2.923116 -2.394483 0.43871
O  -3.477167 0.459427 0.137976
O  1.160969 -2.711116 -3.596904
O  -1.935373 3.004339 -0.105944
O  -3.240937 3.899319 -2.398818
O  1.40209 1.626534 2.907916
O  -4.140276 -2.369423 -0.329416
O  0.382492 -2.362253 1.402118
N  2.286343 1.967602 0.78112
N  -1.584263 -1.145792 1.404808
C  2.114798 0.586266 0.338874
C  3.456647 -0.054179 -0.115213
C  1.050031 0.482886 -0.782168
C  3.231347 -1.489412 -0.66694
C  2.174567 -1.483878 -1.788611
C  -1.343599 0.853826 -1.155747
C  -2.444126 -0.15373 -0.723122
C  1.845967 -2.879564 -2.305293
C  -1.776179 2.318723 -1.383782
C  -1.887334 -1.412023 -0.012789
C  -3.060303 2.440876 -2.219579
C  1.900168 2.40371 2.038421
C  -2.941182 -2.525947 0.024102
C  2.087291 3.892593 2.300688
C  -0.434038 -1.591686 2.01808
C  -0.192568 -1.096127 3.42828
H  1.731427 0.025976 1.209165
H  3.934201 0.572766 -0.895008
H  1.313963 1.129727 -1.658011
H  4.194983 -1.851118 -1.071014
H  2.54878 -0.868892 -2.638779
H  -0.975246 0.466638 -2.12902
H  -2.936986 -0.504176 -1.656177
H  2.738038 2.631469 0.150299
H  2.791615 -3.447977 -2.426117
H  1.20933 -3.402354 -1.564814
H  -0.958072 2.812237 -1.959892
H  -0.956794 -1.770196 -0.494226
H  4.176361 -0.927856 1.500282
H  1.957842 -2.343689 0.74527
H  -3.904771 2.00706 -1.652611
H  -2.946443 1.938897 -3.203296
H  -4.252696 -0.166392 0.09938
H  -2.165547 -0.422739 1.843898
H  0.880738 -3.59786 -3.935272
H  -2.41741 3.849106 -0.314259
H  -2.588979 -3.489513 0.461632
H  1.097124 4.382028 2.276509
H  2.505971 4.031147 3.310439
H  2.7438 4.389464 1.565103
H  -4.160764 4.086829 -2.7088
H  -1.133339 -0.875992 3.961978
H  0.378696 -1.8533 3.987614
H  0.405404 -0.163225 3.385439
