program: Gaussian 09
title: 000131939
version: EM64L-G09RevD.01
frameworkgroup: C1[X(C21H30O6)]
method: RPBEPBE
basis: SDD
operation: Freq
keyword: #pfreq=noraman
keyword: PBEPBE/SDD
title: #p freq=noraman PBEPBE/SDD
converged: YES YES NO NO
title: Mulliken charges:
elementType: O O O O O O C C C C C C C C C C C C C C C C C C C C C H H H H H H H H H H H H H H H H H H H H H H H H H H H H H H
charge: -0.431902 -0.242150 -0.230322 -0.230851 -0.194785 -0.212443 -0.387825 -0.382889 -0.369689 -0.372755 -0.409456 -0.353521 -0.496573 -0.356781 0.299154 -0.696436 -0.377680 0.194330 0.065177 0.245514 -0.057848 -0.028707 0.071779 0.064168 -0.797104 -0.494845 -0.496427 0.196828 0.196517 0.191945 0.193265 0.196765 0.193516 0.190282 0.190227 0.230852 0.211188 0.187670 0.187702 0.221015 0.223864 0.194945 0.195218 0.215378 0.209599 0.209552 0.280095 0.242323 0.263852 0.241429 0.381922 0.253047 0.232059 0.233600 0.256488 0.226856 0.232868
chargesum: 0.00000
title: Mulliken charges with hydrogens summed into heavy atoms:
elementType: O O O O O O C C C C C C C C C C C C C C C C C C C C C
charge: -0.049979 -0.242150 -0.230322 -0.230851 -0.194785 -0.212443 0.005520 0.002320 0.020591 0.007754 0.032584 0.021851 -0.051693 0.033383 0.299154 -0.061907 -0.097585 0.194330 0.065177 0.245514 -0.057848 -0.028707 0.071779 0.064168 -0.049501 0.223862 0.219786
polarizability: 2.71850699e+02 4.68257555e+01 2.93877889e+02 -9.63104039e+00 2.75658988e+01 2.69633726e+02
1716.lowfreq: -6.7320 0.0002 0.0004 0.0011 3.7920 9.7120 9.9563 18.5390 29.0195
frequency: 9.1921 18.3496 28.9990 34.0090 38.4953 39.1383 47.3689 53.5587 57.0074 66.2148 67.2945 85.6796 97.3965 101.2802 107.9773 117.7760 126.0266 142.2388 152.4874 161.0826 165.8329 172.1774 184.6119 197.0093 208.7892 210.9065 221.9256 235.6699 246.6226 287.4497 299.5955 321.4602 332.6653 345.6590 358.3818 365.3644 385.9096 390.5876 405.7297 421.9281 442.8269 455.4865 468.3076 504.9689 528.0839 542.7101 560.7546 591.8233 625.8610 646.2372 704.4004 720.1268 723.5787 724.9465 735.2185 745.9223 761.9086 783.9677 803.9761 830.9702 846.6514 858.4586 882.7912 887.4931 900.1034 933.3300 951.5329 980.3726 989.8747 992.3277 1011.1882 1023.8416 1032.0895 1039.4990 1050.2411 1065.0372 1070.0245 1080.2873 1082.0942 1094.6099 1100.1004 1101.7465 1110.8772 1120.8655 1139.8710 1151.2965 1165.8153 1182.4260 1188.3040 1210.6385 1220.4227 1247.3622 1250.1016 1253.7391 1276.6173 1278.8262 1279.5878 1288.1647 1290.9425 1293.8234 1297.2570 1310.5993 1317.8568 1327.5137 1334.4366 1348.6816 1356.4105 1356.4883 1371.5193 1387.5182 1398.2954 1433.3917 1439.5608 1444.2173 1451.3107 1452.4442 1453.7554 1454.0037 1455.6053 1460.6208 1460.8245 1464.2246 1465.3774 1467.8251 1473.6860 1475.8164 1479.7632 1485.3560 1488.4552 1509.5071 1513.3999 1555.2355 1610.5482 1628.5562 1642.2007 2948.3351 2948.9080 2951.1253 2954.1139 2961.4221 2967.8396 2970.7874 2981.2801 2983.3573 2986.7043 2988.5530 2996.7795 3003.1096 3005.6197 3006.5413 3009.8401 3024.8589 3037.9537 3049.7771 3063.7192 3067.3878 3069.6806 3084.6952 3105.3656 3114.3494 3116.3668 3117.5413 3135.1967 3137.6005 3521.6221
redmass: 5.1564 4.4160 4.2200 3.9759 4.0631 1.8426 4.2383 3.7806 3.9671 6.2982 5.1157 1.6616 3.4064 3.8179 4.0810 3.7793 1.8239 2.3319 1.9746 1.8472 1.1409 1.8488 4.2870 1.5546 3.1162 2.4570 1.1414 3.8504 4.0768 3.5558 4.7406 3.5024 3.3525 4.8130 4.9588 3.4753 5.7551 8.2234 4.8670 4.7057 4.1645 6.9249 3.2190 3.9924 5.7415 3.5905 4.9387 5.8711 1.4322 5.3823 5.2058 1.0610 2.9212 1.2308 1.2658 3.1028 1.4024 3.2040 2.1300 2.0411 4.2503 6.4935 1.4072 1.8696 2.1011 2.7796 1.4235 4.7627 4.4829 3.7498 1.2986 2.7533 1.6258 3.0274 3.1066 1.9917 2.2329 2.2433 2.1610 2.2189 1.2485 1.2838 4.0668 2.6478 1.5290 1.5732 1.9475 2.6784 1.9656 1.2793 1.4434 1.5239 2.9786 1.3342 1.2203 1.2794 1.1627 1.0575 1.6065 1.4807 1.1427 1.7213 2.3434 5.5859 1.3810 1.5147 1.6425 1.6963 1.9146 1.2191 1.2356 1.2186 1.1985 1.0916 1.0684 1.0633 1.0628 1.0856 1.0611 1.0755 1.0750 1.0789 1.0690 1.0849 1.0815 1.0429 1.0855 1.0914 1.0952 9.3366 7.8046 8.0646 8.2708 7.9208 8.6303 1.0591 1.0591 1.0594 1.0595 1.0590 1.0588 1.0366 1.0659 1.0947 1.0406 1.0967 1.1000 1.0295 1.0286 1.0620 1.1026 1.1042 1.1041 1.1013 1.0913 1.1007 1.0993 1.1002 1.0870 1.1030 1.1005 1.1041 1.1064 1.1063 1.0640
irintensity: 0.0254 0.0515 1.6723 3.4011 2.9111 0.8469 3.2551 6.9650 4.2169 1.4313 1.1554 0.2810 0.5303 0.1920 1.4366 0.2542 0.1887 0.1360 0.2119 0.9627 1.4482 0.4972 4.1384 0.2757 1.1278 1.5398 0.0038 2.6466 0.6378 0.5819 3.6632 4.5615 1.3289 1.2577 0.1110 1.8606 15.0519 9.7581 3.9320 8.0627 2.6991 16.6524 0.5402 15.7287 32.6160 16.1225 35.6999 0.8215 90.1063 1.7237 35.9993 13.9617 19.5071 3.3478 11.3259 5.4424 4.7646 1.0571 9.2548 3.6275 12.6311 41.8072 1.8406 4.9582 11.7720 5.2578 30.1534 97.1429 0.3553 1.4961 2.9767 115.1177 4.8558 49.5668 13.9618 256.9151 138.4836 0.2121 0.3840 44.4188 0.2560 8.8026 60.8913 19.1914 15.2881 13.5947 68.8542 112.4661 21.9509 17.2373 2.4802 67.2258 303.7783 4.7588 0.9546 37.1700 13.3204 0.7523 58.3923 38.2557 2.9727 21.5900 48.5052 0.3469 0.6870 2.2535 0.5775 0.2740 21.1535 11.1700 54.0416 26.7407 82.5185 14.4441 22.7445 34.0756 21.5368 18.3558 36.0230 0.6712 0.0736 1.1432 2.6450 0.7175 2.0306 11.9660 2.0747 1.7443 31.4299 7.8847 301.3149 301.0780 180.3536 10.3958 61.5703 1.0692 0.2203 2.5002 0.1892 43.5532 146.2060 39.1385 22.4762 2.2488 5.5269 2.4161 1.5539 60.9844 42.7310 23.9591 3.3687 0.4414 104.5755 67.4647 10.2294 97.5107 55.0950 35.7940 2.6035 35.9244 2.7874 28.1160 24.5672 19.3469 49.4739
temp: 298.150 k
press: 1.00000 atm
elementType: 8 8 8 8 8 8 6 6 6 6 6 6 6 6 6 6 6 6 6 6 6 6 6 6 6 6 6 1 1 1 1 1 1 1 1 1 1 1 1 1 1 1 1 1 1 1 1 1 1 1 1 1 1 1 1 1 1
symmnumber: 1
zpe: 1232261.3 jmol-1
zpe.correction: 0.469344 hartree
zpe.thermalcorrener: 0.501070 hartree
zpe.thermalcorrenthalpy: 0.502014 hartree
zpe.thermalcorrgfe: 0.401091 hartree
zpe.sumelectzpe: -1267.430707 hartree
zpe.sumelectthermal: -1267.398981 hartree
zpe.sumelectthermalent: -1267.398037 hartree
zpe.sumelectthermalfe: -1267.498960 hartree
dipole: 1.6204 -1.1020 -1.0309
dipole: 2.2142
quadrupole: -162.7571 -159.2842 -163.4530
quadrupole: 10.3644 -1.8237 -6.7913
quadrupole: -0.9257 2.5473 -1.6216 10.3644 -1.8237 -6.7913
hfenergy: -1267.9000507 hartree
pointgroup: C01 [X(C21H30O6)]
dipole: -0.6398698 -0.5391725 0.2423606 debye
polarizability: 275.4354911|-42.1705904|304.9439539|-20.8149571|-19.556406|254.982869 unknown
InChI: InChI=1S/C21H30O6/c1-5-6-7-8-9-10-11-12-15(21(24)25)13-16-14(2)17(22)19(26-3)20(27-4)18(16)23/h13,24H,5-12H2,1-4H3
charge 0 multiplicity 1
57 atoms
O  -0.939493 4.224779 1.654787
O  1.089892 4.784299 0.684851
O  4.055107 -1.405923 -2.291404
O  4.12579 -3.164072 -0.344043
O  2.807209 1.180003 -1.811934
O  3.219262 -2.370025 2.29943
C  -3.983789 0.392619 -0.279317
C  -5.16757 -0.505565 0.146568
C  -2.886709 0.509673 0.802298
C  -6.252079 -0.644695 -0.94535
C  -1.721826 1.432708 0.380327
C  -7.444627 -1.529156 -0.515735
C  -0.600656 1.488461 1.459159
C  -8.523318 -1.677688 -1.61292
C  0.533981 2.41079 1.059357
C  -9.715566 -2.553979 -1.171003
C  1.760489 2.023523 0.576113
C  2.314044 0.659476 0.485223
C  0.302489 3.890817 1.083153
C  2.423942 -0.234764 1.531072
C  2.900714 0.325892 -0.866284
C  3.070502 -1.577209 1.306192
C  3.534486 -0.998073 -1.078719
C  3.549421 -1.943804 -0.048175
C  2.008313 0.040372 2.954183
C  4.405624 -0.456651 -3.374114
C  3.897754 -4.369314 0.486873
H  -4.364255 1.405352 -0.527502
H  -3.536241 -0.008438 -1.21257
H  -4.785636 -1.513245 0.413847
H  -5.627062 -0.092945 1.069131
H  -3.335747 0.894584 1.741592
H  -2.492874 -0.502154 1.035216
H  -5.794019 -1.068168 -1.86379
H  -6.625987 0.363499 -1.221805
H  -2.108175 2.453053 0.199193
H  -1.285775 1.074815 -0.573798
H  -7.071991 -2.535646 -0.231137
H  -7.909481 -1.10111 0.397239
H  -0.219196 0.465149 1.611517
H  -1.048508 1.828172 2.412061
H  -8.889724 -0.671312 -1.90175
H  -8.059966 -2.112014 -2.522327
H  -10.470797 -2.647983 -1.97302
H  -10.216428 -2.122192 -0.283786
H  -9.37929 -3.573252 -0.901808
H  2.392767 2.819487 0.157356
H  1.804697 1.109589 3.117272
H  2.796527 -0.304327 3.645309
H  1.10151 -0.533142 3.226781
H  -1.02638 5.216144 1.658213
H  3.501185 -0.046405 -3.847848
H  4.979905 -1.07704 -4.079047
H  5.022249 0.373388 -2.990792
H  4.450173 -4.303714 1.435661
H  2.823622 -4.507352 0.699087
H  4.276313 -5.189184 -0.142485
