program: Gaussian 09
title: 000131938
version: EM64L-G09RevD.01
frameworkgroup: C1[X(C11H20NO5P)]
method: RPBEPBE
basis: SDD
operation: Freq
keyword: #p
keyword: freq=noraman
keyword: PBEPBE/SDD
title: #p freq=noraman PBEPBE/SDD
converged: NO YES NO NO
title: Mulliken charges:
elementType: P O O O O O N C C C C C C C C C C C H H H H H H H H H H H H H H H H H H H H
charge: 1.227417 -0.671783 -0.675761 -0.415636 -0.623621 -0.232641 -0.282341 -0.070746 -0.039278 -0.505853 0.054364 -0.467681 -0.466499 -0.495187 -0.543963 -0.187961 -0.871341 0.140369 0.223343 0.204174 0.207927 0.211991 0.243897 0.206497 0.202029 0.201093 0.249808 0.221456 0.221308 0.227928 0.219000 0.264720 0.283562 0.300670 0.279803 0.388208 0.389580 0.381146
chargesum: 0.00000
title: Mulliken charges with hydrogens summed into heavy atoms:
elementType: P O O O O O N C C C C C C C C C C C
charge: 1.227417 -0.283575 -0.286181 -0.034491 -0.623621 -0.232641 -0.002538 0.152597 0.164896 -0.085935 0.298261 -0.059155 -0.015598 -0.052423 -0.097035 0.076759 -0.287109 0.140369
polarizability: 1.99947915e+02 4.18989392e+00 1.52871364e+02 -3.33922984e+00 -1.58191032e+00 1.24389587e+02
1716.lowfreq: -35.0368 -3.8272 -0.0012 -0.0010 0.0012 8.1906 15.8941 36.8342 46.4238
frequency: 3.1374 36.6949 45.9470 53.9406 82.2971 101.2133 130.5183 136.2522 167.3146 174.3632 199.7807 210.8001 228.8214 266.1405 287.1177 296.0096 316.3912 321.4945 344.2988 355.4878 365.5534 387.5767 412.2714 430.3453 458.6533 485.0173 531.6471 574.5847 588.1649 591.6235 621.0728 630.9905 648.9125 698.0752 720.0506 737.1865 757.2491 790.7757 829.0987 867.8159 892.2625 894.1044 906.6979 942.2361 952.1777 962.9835 982.3902 988.0145 993.3855 1016.1210 1046.8410 1058.5840 1060.7661 1080.8052 1092.4977 1105.0610 1120.0640 1125.3854 1130.8461 1155.1500 1167.6963 1198.7493 1223.3869 1236.7934 1250.6609 1257.6098 1273.0332 1280.1113 1283.8879 1301.8121 1316.4876 1322.7727 1329.1632 1332.4139 1342.5833 1344.9872 1352.1048 1356.9957 1368.2273 1371.5869 1413.3607 1448.5313 1456.0029 1459.6805 1465.9931 1468.4928 1481.6133 1662.1610 2941.3723 2952.1405 2963.2987 2969.3755 2971.0881 2977.0458 2979.9072 2983.1952 3008.4125 3013.9723 3020.8306 3021.3251 3038.1732 3042.1160 3045.0749 3085.0698 3454.1347 3510.1159 3588.7515 3594.4213
redmass: 7.4016 6.3985 6.6529 5.9390 4.7140 5.9502 4.1781 2.2077 4.0470 2.8959 3.1210 3.3990 2.5181 2.6613 4.0956 2.6791 2.9915 2.5240 3.4427 2.7649 1.4831 2.2877 2.7461 2.5672 4.2206 3.3988 3.2008 2.0631 1.5490 2.2452 1.8931 3.8979 4.2301 3.8228 8.0005 4.3050 2.1654 2.3336 1.9126 2.2011 2.3911 2.3406 2.0070 3.0801 2.1331 2.0595 2.0538 1.2066 2.2096 2.0337 2.6902 1.8312 1.8895 1.8685 2.5508 1.5640 2.4995 1.7400 2.2759 1.8419 1.4395 1.3963 1.3800 1.6076 1.3974 1.2955 1.3097 1.3660 1.2749 1.3824 1.2350 1.2918 1.4086 1.3292 1.4388 1.4444 1.5250 1.5388 1.3782 1.5030 1.0838 1.1527 1.0830 1.1661 1.0851 1.0918 1.0944 8.4275 1.0805 1.0766 1.0605 1.0638 1.0705 1.0650 1.0684 1.0724 1.0849 1.0597 1.0983 1.0982 1.1006 1.1019 1.1014 1.1037 1.0749 1.0640 1.0659 1.0661
irintensity: 0.4413 0.3902 0.4958 0.5914 1.8813 0.4435 0.9483 9.1250 1.8662 1.8198 5.8203 11.1629 10.5170 9.4294 19.9733 9.6241 6.6590 31.1838 93.8364 65.6981 137.9454 15.8991 2.2069 9.4173 1.5106 26.0811 1.5949 23.4966 51.1610 41.0290 155.5820 78.5324 8.0225 80.3974 265.8539 83.3188 0.1567 8.4616 33.4204 11.4837 0.8815 3.7735 0.8244 3.1411 5.3861 3.0197 6.9887 34.3047 106.9259 16.7919 11.3700 54.8718 104.0074 117.0172 11.4744 2.6480 22.9581 12.6124 38.2141 18.3341 6.2469 5.0699 5.9099 1.2437 5.4987 0.5138 8.6988 9.7698 1.3326 30.2036 2.5543 3.5377 1.1809 1.9575 7.9514 2.5112 45.5550 4.7496 4.0342 5.9882 10.2541 13.0772 10.9868 6.9220 10.3171 3.2831 16.4952 238.6117 21.9161 6.9699 36.5930 24.9315 26.3463 64.8670 27.5684 24.0729 10.0675 7.7969 26.0295 50.1098 56.7327 31.5368 52.3654 4.3884 8.2522 24.7992 53.5962 45.5881
temp: 298.150 k
press: 1.00000 atm
elementType: 15 8 8 8 8 8 7 6 6 6 6 6 6 6 6 6 6 6 1 1 1 1 1 1 1 1 1 1 1 1 1 1 1 1 1 1 1 1
symmnumber: 1
zpe: 815361.4 jmol-1
zpe.correction: 0.310555 hartree
zpe.thermalcorrener: 0.329856 hartree
zpe.thermalcorrenthalpy: 0.330800 hartree
zpe.thermalcorrgfe: 0.260241 hartree
zpe.sumelectzpe: -1201.847070 hartree
zpe.sumelectthermal: -1201.827769 hartree
zpe.sumelectthermalent: -1201.826825 hartree
zpe.sumelectthermalfe: -1201.897384 hartree
dipole: 0.9382 -1.2824 2.2247
dipole: 2.7339
quadrupole: -120.8808 -115.5877 -117.2899
quadrupole: 3.3820 -0.4038 5.4770
quadrupole: -2.9613 2.3318 0.6295 3.3820 -0.4038 5.4770
hfenergy: -1202.1576247 hartree
pointgroup: C01 [X(C11H20N1O5P1)]
dipole: -0.37403 0.5765393 0.8274011 debye
polarizability: 199.9507905|3.7973897|152.8300045|4.1633684|-0.6429863|124.428071 unknown
InChI: InChI=1S/C11H20NO5P/c13-11(14)10-4-9-3-7(6-18(15,16)17)1-2-8(9)5-12-10/h7-10,12-13,15-16H,1-6H2
charge 0 multiplicity 1
38 atoms
P  -4.402879 0.493642 -0.296568
O  -5.177351 1.901674 -0.961295
O  -4.634983 0.596828 1.424128
O  4.418076 2.252307 -0.318642
O  -4.951582 -0.871256 -0.918213
O  5.353638 0.14526 -0.023466
N  2.907204 -1.031211 -0.774394
C  0.808238 -0.065619 1.117896
C  0.853173 -1.550955 0.643429
C  -0.226131 0.770459 0.317581
C  -1.639833 0.132902 0.367579
C  -0.566743 -2.171003 0.620911
C  -1.592043 -1.32128 -0.166966
C  2.227387 0.562264 1.090068
C  1.574863 -1.669856 -0.731098
C  2.910499 0.366873 -0.309905
C  -2.628404 1.022622 -0.416842
C  4.344183 0.857532 -0.218313
H  0.468536 -0.064203 2.176467
H  1.468501 -2.114884 1.377828
H  -0.260068 1.797112 0.735301
H  0.085716 0.871104 -0.742077
H  -1.966769 0.104989 1.428064
H  -0.927101 -2.282601 1.664455
H  -0.522097 -3.19258 0.192968
H  -1.330553 -1.300665 -1.244759
H  -2.59203 -1.79104 -0.104112
H  2.8581 0.069811 1.857695
H  2.176829 1.640971 1.334614
H  1.698275 -2.736391 -0.995958
H  0.952307 -1.218342 -1.52811
H  2.380361 0.998107 -1.047928
H  -2.391281 1.03849 -1.496536
H  -2.614865 2.064175 -0.048108
H  3.656242 -1.579019 -0.330177
H  -6.073073 1.719642 -1.34521
H  -5.416645 0.085425 1.755093
H  5.363802 2.541316 -0.2010
