program: Gaussian 09
title: 000131929
version: EM64L-G09RevD.01
frameworkgroup: C1[X(C9H14N3O6P)]
method: RPBEPBE
basis: SDD
operation: Freq
keyword: #p
keyword: freq=noraman
keyword: PBEPBE/SDD
title: #p freq=noraman PBEPBE/SDD
converged: YES YES NO NO
title: Mulliken charges:
elementType: P O O O O O O N N N C C C C C C C C C H H H H H H H H H H H H H H
charge: 1.398890 -0.509506 -0.441729 -0.249642 -0.745893 -0.670068 -0.565371 -0.587164 -0.005464 -0.664096 0.310806 -0.370924 0.414879 0.104024 -0.510376 0.009148 -0.564580 0.188580 -0.824849 0.259163 0.244009 0.258973 0.253075 0.272980 0.330109 0.228324 0.281693 0.241270 0.381458 0.398880 0.319326 0.413126 0.400950
chargesum: 0.00000
title: Mulliken charges with hydrogens summed into heavy atoms:
elementType: P O O O O O O N N N C C C C C C C C C
charge: 1.398890 -0.509506 -0.060272 -0.249642 -0.332767 -0.269119 -0.565371 0.015926 -0.005464 0.054110 0.310806 -0.111761 0.414879 0.104024 -0.007395 0.009148 -0.311506 0.188580 -0.073562
polarizability: 2.32227790e+02 5.14174955e+00 1.57453879e+02 -4.86213465e+00 8.68412233e+00 1.20859347e+02
1716.lowfreq: -6.4211 -3.2983 0.0016 0.0017 0.0020 6.2264 25.5113 46.4707 54.2378
frequency: 25.4316 46.4468 54.2275 61.1147 80.7132 101.9037 104.7063 132.8169 136.8904 167.6346 175.9539 183.3330 215.7334 233.9313 244.0110 251.0827 272.4046 293.4716 309.1259 315.1807 327.6811 331.6009 340.4960 351.9096 368.6449 390.0943 399.9436 414.0624 511.1220 515.2420 518.4606 569.5906 589.6051 613.8281 623.5306 642.7046 655.9528 680.8944 705.8347 727.8683 736.6839 763.1174 771.4846 787.0250 837.2654 861.3081 901.9759 908.8684 950.3510 993.2241 1002.9941 1041.6050 1045.8187 1053.2578 1087.1077 1097.4272 1106.9772 1177.1484 1198.7378 1206.1724 1225.1916 1246.8505 1263.3925 1296.2413 1315.0773 1344.5947 1361.9179 1385.3214 1400.0040 1401.7104 1453.0435 1475.5044 1479.1516 1482.8265 1544.4799 1589.3648 1625.7682 1632.4971 1651.4734 2957.5419 3020.8226 3031.6169 3049.1376 3089.4118 3116.8185 3121.6929 3389.3820 3456.7390 3585.4848 3589.9999 3594.6516 3598.4261 3605.4027
redmass: 6.3283 6.8785 4.6138 7.3362 5.3845 6.8285 6.0883 4.1278 6.8590 2.4671 2.0469 1.4852 3.4044 3.5651 1.3154 2.6015 3.2960 4.4134 2.5503 2.2106 2.4497 1.6392 3.9496 3.1255 5.5038 2.1589 5.0123 5.5558 3.2719 5.0200 4.6991 4.0485 4.7366 3.3153 1.5958 7.7839 1.8349 2.8263 8.9624 4.3882 8.3906 2.7700 1.7901 3.2232 4.3101 6.3242 2.9075 1.6299 2.0954 1.6525 1.3022 1.5505 3.0416 1.3829 2.4720 2.8578 2.4986 1.7390 1.2327 2.1079 1.7548 2.1077 3.1291 1.6010 2.3962 3.5045 1.4191 1.6837 2.5424 1.3368 1.4108 1.3731 1.3368 1.0966 6.0396 6.9099 1.7884 1.3708 1.5473 1.0413 1.0573 1.0966 1.0845 1.1082 1.0945 1.0916 1.0547 1.0446 1.0659 1.0663 1.0985 1.0968 1.0661
irintensity: 4.3803 1.3407 1.1048 1.0887 1.2160 3.7674 6.8873 1.2136 3.0351 10.4065 40.6430 0.5301 14.5832 1.2504 66.5416 44.5355 24.5007 2.5268 18.5399 19.3064 35.8372 63.7354 12.2041 73.6674 44.2505 56.2417 38.8553 15.0988 15.0417 1.9683 5.6557 17.5350 38.9088 15.2219 85.5963 21.7427 199.3466 30.2227 200.4616 84.5483 92.7437 81.4941 105.4775 28.4047 14.4564 342.9046 12.6681 17.3873 7.4706 3.2646 28.4906 4.7375 26.6995 44.4092 69.6245 194.9602 47.7413 153.9399 4.8400 71.4288 8.9707 18.6638 20.3337 27.0507 83.1506 22.2095 29.0187 71.8213 39.5294 9.7297 6.7812 13.0773 10.1487 15.5053 4.6671 31.7077 141.5382 46.6040 199.8179 22.5089 16.0399 17.7968 9.0186 6.0524 3.8373 17.0144 214.8457 14.3140 60.9608 89.5250 12.1270 62.8123 69.9246
temp: 298.150 k
press: 1.00000 atm
elementType: 15 8 8 8 8 8 8 7 7 7 6 6 6 6 6 6 6 6 6 1 1 1 1 1 1 1 1 1 1 1 1 1 1
symmnumber: 1
zpe: 637581.3 jmol-1
zpe.correction: 0.242842 hartree
zpe.thermalcorrener: 0.263857 hartree
zpe.thermalcorrenthalpy: 0.264802 hartree
zpe.thermalcorrgfe: 0.193208 hartree
zpe.sumelectzpe: -1306.723176 hartree
zpe.sumelectthermal: -1306.702160 hartree
zpe.sumelectthermalent: -1306.701216 hartree
zpe.sumelectthermalfe: -1306.772810 hartree
dipole: 2.6429 0.0465 -2.7172
dipole: 3.7908
quadrupole: -92.5233 -118.3768 -129.6944
quadrupole: 4.0495 -19.9523 5.2860
quadrupole: 21.0082 -4.8453 -16.1629 4.0495 -19.9523 5.2860
hfenergy: -1306.9660175 hartree
pointgroup: C01 [X(C9H14N3O6P1)]
dipole: -0.9853403 -0.2886178 -1.0817267 debye
polarizability: 228.9390943|16.1803684|157.762115|8.3320196|-11.8044666|123.8398079 unknown
InChI: InChI=1S/C9H14N3O6P/c1-4-8(13)6(7(10)9(11)14)5(2-12-4)3-18-19(15,16)17/h2,7,13,15-16H,3,10-11H2,1H3
charge 0 multiplicity 1
33 atoms
P  -3.700423 -0.01816 0.361496
O  -2.149122 0.68029 0.378108
O  3.148672 -0.501424 1.136122
O  1.635766 -2.852443 -0.695412
O  -3.286569 -1.624074 -0.156218
O  -4.494482 0.495982 -1.093025
O  -4.534293 0.146145 1.691335
N  0.894892 -1.712244 2.068934
N  2.010456 2.515683 -0.688571
N  -0.686692 -2.858379 -0.863243
C  0.936739 0.025648 0.272258
C  0.345454 -1.294895 0.773251
C  0.13765 0.952425 -0.462719
C  2.29631 0.384381 0.462076
C  -1.282126 0.666609 -0.870378
C  2.800833 1.632314 -0.016425
C  0.712798 2.16826 -0.901998
C  0.510818 -2.395269 -0.340131
C  4.246454 2.021667 0.213651
H  -0.734007 -1.127948 0.926335
H  -1.663842 1.453574 -1.542006
H  -1.390596 -0.317522 -1.35957
H  0.107776 2.897297 -1.454221
H  0.372644 -2.480663 2.499736
H  1.909067 -1.858511 2.047963
H  4.9557 1.323708 -0.277737
H  4.410546 3.019446 -0.219825
H  4.498042 2.068019 1.2917
H  4.091574 -0.215351 1.055103
H  -1.599434 -2.496747 -0.557563
H  -0.646345 -3.602568 -1.561404
H  -4.065081 -2.209575 -0.333433
H  -5.152079 1.226223 -0.958889
