program: Gaussian 09
title: 000131923
version: EM64L-G09RevD.01
frameworkgroup: C1[X(C17H16F2N4O2S)]
method: RPBEPBE
basis: SDD
operation: Freq
keyword: #p
keyword: freq=noraman
keyword: PBEPBE/SDD
title: #p freq=noraman PBEPBE/SDD
converged: YES YES NO NO
title: Mulliken charges:
elementType: S F F O O N N N N C C C C C C C C C C C C C C C C C H H H H H H H H H H H H H H H H
charge: 0.463603 -0.204587 -0.198609 -0.217848 -0.218644 -0.183973 -0.189643 -0.579922 -0.725877 -0.181249 -0.469264 -0.509138 0.147867 -0.147071 -0.424157 -0.371883 -0.360948 -0.467945 0.126634 0.258584 0.114647 0.292496 0.076636 0.259562 -0.644307 0.205076 0.287702 0.249821 0.257858 0.256240 0.265917 0.238584 0.251399 0.227086 0.237736 0.230853 0.229566 0.215526 0.309946 0.264414 0.279691 0.347623
chargesum: 0.00000
title: Mulliken charges with hydrogens summed into heavy atoms:
elementType: S F F O O N N N N C C C C C C C C C C C C C C C C C
charge: 0.463603 -0.204587 -0.198609 -0.217848 -0.218644 -0.183973 -0.189643 -0.035817 -0.378254 0.106453 0.038416 0.013019 0.147867 0.091513 -0.424157 0.106602 0.107641 -0.022854 0.126634 0.258584 0.114647 0.292496 0.076636 0.259562 -0.334361 0.205076
polarizability: 3.95515753e+02 -1.31557540e+01 2.60317612e+02 7.25927151e+00 8.48438883e+00 1.27767687e+02
1716.lowfreq: -14.9960 -6.1747 -4.7158 -0.0013 -0.0013 -0.0009 17.6775 30.4091 49.1669
frequency: 16.5181 29.7659 49.1305 52.9509 67.9545 80.4198 104.6343 120.4787 123.3051 156.7156 167.5380 177.5053 181.5992 190.5724 193.2490 209.8483 230.2266 244.2786 259.2514 273.6994 294.2552 308.7522 331.4761 354.6878 361.8536 378.8214 387.0241 396.8046 402.7962 457.0729 462.3121 475.1289 503.0212 515.3236 524.2663 531.2253 535.3984 557.6709 581.3502 594.5232 617.1142 649.8937 685.8603 715.8289 721.3091 747.7784 756.6974 771.7684 794.0193 813.9895 830.8750 834.2063 849.8124 880.6782 901.6656 912.7332 935.8226 939.7355 950.1709 972.2853 994.7168 1012.2649 1016.7373 1059.5670 1073.4123 1074.7403 1102.5471 1104.6727 1114.5366 1136.8837 1144.0112 1148.5296 1157.4010 1167.9245 1172.0464 1192.2258 1209.6123 1227.4523 1246.8576 1257.8060 1262.0208 1280.0615 1291.4753 1303.2565 1313.1993 1332.3537 1343.7289 1351.8753 1374.8518 1388.9278 1390.6605 1438.6639 1458.8366 1460.6932 1463.1683 1481.2529 1487.4305 1494.7907 1530.1008 1544.2808 1580.7547 1625.8307 1637.3699 1642.0043 2989.8251 2995.5108 2997.1102 3009.2004 3058.2335 3073.6551 3083.4615 3107.8312 3114.8708 3127.7188 3165.4099 3208.7956 3226.1030 3477.4153 3579.8992 3611.3258
redmass: 4.9634 3.5589 6.5052 8.5567 8.0951 4.2946 3.7631 2.5760 9.6315 4.5744 6.9918 4.0598 3.1411 4.3276 5.0953 3.5084 1.4247 6.5972 9.3421 6.3068 11.1667 5.8289 12.8307 4.8249 3.3536 2.5649 4.1529 2.5446 3.1841 6.4958 2.2864 5.3937 5.5081 5.3356 10.8295 1.5252 6.3155 4.1503 7.0104 6.7721 8.0255 5.4368 11.2950 7.8512 3.8935 4.1864 6.2453 1.4926 7.8407 1.8338 1.9631 1.6953 5.1737 2.2472 4.5531 1.4179 2.2606 2.4787 2.9995 6.5111 1.7244 3.3594 1.7310 1.2129 2.8658 1.1919 1.6645 2.0188 3.0236 1.8351 1.4460 1.5558 4.3800 1.3744 2.4521 2.3794 1.4270 7.1063 1.9882 1.3745 2.1839 1.3406 4.1237 1.3137 1.7286 1.4427 1.5706 3.2112 4.5068 8.3302 1.6132 1.0866 2.3573 1.6165 1.3193 1.0831 1.2044 5.3961 9.0723 11.5735 11.0418 9.4566 1.0984 9.9845 1.0661 1.0614 1.0682 1.0770 1.1027 1.1013 1.1046 1.0516 1.0625 1.0905 1.0919 1.1178 1.1150 1.0453 1.0800 1.0985
irintensity: 1.0840 0.7600 0.5117 1.8259 0.4927 1.8959 0.2476 0.0608 2.1593 1.1838 0.3390 3.8558 1.2789 7.3129 3.2732 10.6954 51.5654 2.7174 7.7722 4.7730 2.6260 0.0441 6.4560 8.7199 2.5791 53.8330 16.7006 46.1977 50.9414 20.8411 1.3270 17.0589 17.7184 5.7370 16.3536 241.2348 14.6744 0.2657 10.2076 15.6420 0.7810 4.9731 3.1950 2.8636 0.3695 5.9031 25.2523 2.0237 18.6695 6.2854 4.6377 12.6830 7.2787 11.3295 4.0085 17.5308 19.5072 24.2196 17.3252 22.0862 11.2880 13.2005 8.9305 46.5239 30.3212 5.0468 10.8106 4.6021 41.8864 26.9984 15.5039 23.4518 17.7866 0.7424 15.5398 9.5269 19.3924 32.4853 16.9206 15.2575 9.8988 1.7291 38.1244 4.6287 2.5210 63.9047 34.6053 45.2124 44.3583 566.9230 39.1537 8.4716 255.4496 83.6295 8.6022 17.7875 122.5424 236.2775 128.2240 18.3451 165.9616 565.8867 46.9537 218.2747 47.2089 3.5417 45.1140 49.1960 21.5885 17.1725 60.0577 6.8659 1.6803 9.6941 9.6371 0.5864 14.9623 1.9972 94.5063 2.5581
temp: 298.150 k
press: 1.00000 atm
elementType: 16 9 9 8 8 7 7 7 7 6 6 6 6 6 6 6 6 6 6 6 6 6 6 6 6 6 1 1 1 1 1 1 1 1 1 1 1 1 1 1 1 1
symmnumber: 1
zpe: 813960.4 jmol-1
zpe.correction: 0.310021 hartree
zpe.thermalcorrener: 0.333781 hartree
zpe.thermalcorrenthalpy: 0.334725 hartree
zpe.thermalcorrgfe: 0.256146 hartree
zpe.sumelectzpe: -1622.675127 hartree
zpe.sumelectthermal: -1622.651368 hartree
zpe.sumelectthermalent: -1622.650423 hartree
zpe.sumelectthermalfe: -1622.729002 hartree
dipole: 6.4565 -10.3496 -1.1180
dipole: 12.2495
quadrupole: -137.6749 -171.9035 -155.9980
quadrupole: 22.7876 -6.5216 -3.7335
quadrupole: 17.5172 -16.7113 -0.8059 22.7876 -6.5216 -3.7335
hfenergy: -1622.9851482 hartree
pointgroup: C01 [X(C17H16F2N4O2S1)]
dipole: 2.7808818 -3.7959133 -1.0410519 debye
polarizability: 396.4347785|-6.6278727|252.9580918|8.467742|29.3822618|134.2081815 unknown
InChI: InChI=1S/C17H16F2N4O2S/c18-10-5-9-13(12(19)14(10)22-4-3-7(20)6-22)23(8-1-2-8)17-11(15(9)24)16(25)21-26-17/h5,7-8,21H,1-4,6,20H2
charge 0 multiplicity 1
42 atoms
S  -4.203131 -1.743323 -0.834561
F  1.208915 -1.77395 -0.709177
F  2.504195 2.672561 0.796185
O  -2.539452 2.797671 0.887447
O  -5.375991 1.937739 -0.031511
N  -1.548655 -1.140383 -0.216531
N  3.281513 0.074961 -0.130618
N  6.891855 0.593375 0.399201
N  -5.278583 -0.301637 -0.666572
C  -1.315384 -2.587006 -0.287284
C  -0.616362 -3.293095 0.87267
C  -2.112942 -3.51837 0.652239
C  -0.504264 -0.187039 -0.006463
C  5.638746 -0.144677 0.246321
C  -2.842139 -0.652877 -0.28634
C  4.417537 0.760234 0.548301
C  3.770541 -0.995934 -1.059578
C  5.28065 -0.712089 -1.16337
C  1.950309 0.399937 0.070255
C  -0.84768 1.139044 0.410247
C  0.86607 -0.494159 -0.196247
C  -3.240257 0.646265 0.00203
C  -2.256527 1.626406 0.480828
C  1.519882 1.68892 0.543777
C  0.19358 2.05393 0.697137
C  -4.687183 0.896487 -0.20152
H  -1.093212 -2.953914 -1.294192
H  -0.326894 -2.681805 1.732311
H  0.093418 -4.082411 0.614657
H  -2.456999 -4.469797 0.237805
H  -2.797659 -3.060137 1.370502
H  5.652702 -0.983577 0.968721
H  4.235004 0.866081 1.630172
H  4.596114 1.771444 0.135635
H  3.250168 -0.932488 -2.030782
H  3.585012 -2.00222 -0.641332
H  5.85836 -1.616139 -1.421257
H  5.484416 0.063099 -1.926881
H  -0.082124 3.06735 1.005127
H  7.002332 1.398737 -0.223309
H  7.736625 0.023679 0.474421
H  -6.283308 -0.388193 -0.830262
