program: Gaussian 09
title: 000131921
version: EM64L-G09RevD.01
frameworkgroup: C1[X(C21H24N2O3)]
method: RPBEPBE
basis: SDD
operation: Freq
keyword: #p
keyword: freq=noraman
keyword: PBEPBE/SDD
title: #p freq=noraman PBEPBE/SDD
converged: YES YES NO NO
title: Mulliken charges:
elementType: O O O N N C C C C C C C C C C C C C C C C C C C C C H H H H H H H H H H H H H H H H H H H H H H H H
charge: -0.272460 -0.270303 -0.227092 -0.167276 -0.368327 -0.173262 -0.394316 -0.178212 -0.399300 0.283395 -0.611243 -0.613919 0.475235 0.224938 0.522556 -0.401461 -0.436567 -0.432716 -0.364791 -0.234892 -0.232751 -0.222470 -0.237741 -0.242367 -0.241031 -0.500408 0.231699 0.262761 0.223766 0.315905 0.201971 0.207302 0.292285 0.246559 0.233768 0.254065 0.209386 0.236805 0.247411 0.232242 0.244625 0.224647 0.225209 0.223010 0.224814 0.227869 0.226371 0.246915 0.236056 0.241341
chargesum: 0.00000
title: Mulliken charges with hydrogens summed into heavy atoms:
elementType: O O O N N C C C C C C C C C C C C C C C C C C C C C
charge: -0.272460 -0.270303 -0.227092 -0.167276 -0.076042 0.058437 0.092211 0.137693 0.009973 0.283395 -0.130916 -0.150467 0.475235 0.224938 0.522556 -0.164656 -0.189157 -0.200474 -0.120166 -0.010245 -0.007542 0.000540 -0.012927 -0.014498 -0.014660 0.223904
polarizability: 2.98016722e+02 -5.46595615e+00 2.49408941e+02 -2.61196371e+01 -3.00992697e+00 1.74019655e+02
1716.lowfreq: -21.6429 -5.3162 -0.0008 -0.0005 0.0002 5.7247 6.9486 14.8261 27.3383
frequency: -19.8475 14.7027 27.3126 33.5422 39.1997 41.8962 50.2921 65.5659 70.3741 93.7320 95.9913 118.3640 125.4489 143.0477 159.3831 206.7684 214.6822 229.7626 254.2886 261.0099 286.4533 317.8727 339.6776 355.7439 373.9778 401.1432 403.6432 413.5924 449.9730 480.8652 491.9355 508.9914 528.5342 551.8700 566.1225 602.3894 616.8912 617.6348 624.1414 631.4044 699.0898 705.2197 710.2066 721.3831 751.7638 757.6035 773.1618 806.3493 826.2243 843.5052 846.9942 854.9966 877.6654 892.1392 913.1334 914.3469 922.4150 948.1721 955.9787 970.0719 975.6080 986.7485 989.1561 990.7199 993.3451 994.0820 1024.8757 1026.5673 1029.8853 1058.8708 1072.6216 1077.9437 1085.3476 1108.4833 1113.8997 1135.8585 1148.9414 1153.5711 1166.4540 1171.7414 1172.1621 1186.4178 1188.6450 1203.8390 1210.4292 1215.1789 1216.9564 1220.1151 1247.7527 1259.1263 1276.0433 1290.9832 1310.4363 1314.7865 1319.8398 1329.2609 1331.6415 1342.4733 1369.8398 1381.3019 1383.2105 1404.7820 1422.0010 1439.3840 1440.2703 1450.7691 1453.0995 1461.4359 1463.7277 1472.6812 1483.0562 1484.7865 1491.0647 1499.7654 1590.3377 1593.5900 1602.8975 1613.3138 1615.2847 1635.2757 2817.6361 2929.3354 2964.9767 2983.9824 2998.3851 3007.0110 3007.5140 3021.7110 3074.8966 3079.4422 3083.8277 3110.1637 3114.4131 3116.2076 3116.3710 3125.7121 3131.4117 3138.5422 3143.0406 3150.3966 3152.5375 3161.4271 3164.1646 3483.0089
redmass: 3.8038 5.4610 4.0321 5.4282 4.4989 4.5222 5.4069 4.0626 4.7853 1.1895 4.2904 2.8630 4.4997 3.1655 4.5069 4.4367 5.5175 3.3749 5.2857 4.0291 4.0272 3.2938 2.7486 3.5940 2.3371 2.7833 2.8187 3.4365 3.0904 3.3261 4.0876 3.2253 5.0106 3.0853 4.0255 3.9161 5.6502 6.2836 4.6407 2.8440 1.7136 1.8931 2.8040 4.6480 2.0082 1.9952 3.6869 5.0308 3.0989 1.4516 2.0149 1.3202 3.5021 2.1833 1.9761 1.6368 1.6686 2.7644 2.9805 1.4010 1.3908 3.0946 5.9160 2.2734 1.9805 1.3314 2.5624 2.2023 2.3977 2.7518 2.1877 1.7014 1.6263 1.8142 1.2662 3.3594 1.4805 2.0552 1.5780 1.0561 1.0771 1.1164 1.1202 1.5118 1.4252 2.5332 2.1748 2.0570 1.4503 1.6372 1.2955 1.4144 1.4611 1.3916 1.3238 1.3044 1.2736 1.4805 1.4479 6.4002 7.3411 2.2510 1.1775 2.1162 2.1340 1.3943 1.0500 1.1367 1.0516 1.1421 2.2972 2.2242 1.1047 1.0891 6.0075 6.0489 10.3467 6.1736 6.2127 9.8034 1.0785 1.0603 1.0993 1.0766 1.0689 1.0299 1.0671 1.0602 1.0964 1.0991 1.1024 1.1047 1.0866 1.0862 1.0871 1.0867 1.0909 1.0920 1.0958 1.0954 1.1050 1.1015 1.1011 1.0757
irintensity: 0.5339 0.0311 0.4289 1.1264 0.1893 0.2618 1.5484 0.7577 3.9905 0.2901 0.8438 5.3752 0.0967 1.0538 5.7064 1.6252 10.4324 1.3785 0.2931 9.4456 5.9143 12.0870 8.7266 2.3164 5.7339 0.1535 0.0269 4.4996 9.8246 20.0715 27.9388 29.7607 7.6707 27.6935 29.0125 6.6391 0.2946 0.0899 6.2551 29.8819 51.4507 41.0118 9.4844 7.6327 17.8506 63.6506 1.8581 2.2126 3.3052 2.5199 4.8401 1.4445 1.5034 5.0153 5.6268 1.1323 0.5216 11.1189 15.7867 0.1175 0.2142 21.7215 0.0832 1.7065 0.7901 0.3999 2.7368 7.0338 6.4672 1.5391 12.5033 5.4653 37.1410 18.2919 0.5781 232.4663 13.3115 51.0390 82.3663 0.4176 5.7955 1.3959 3.0636 59.8075 23.7198 3.9687 0.5499 14.9024 6.1668 21.5665 22.6335 42.4750 48.1531 9.1985 88.1061 4.7790 1.4812 5.5085 20.6366 0.5006 0.4224 83.5855 17.2492 5.9433 8.5872 7.9867 14.3549 10.0462 11.0560 6.1720 22.0975 18.2723 26.4406 5.3956 1.5473 6.0661 202.0669 13.8581 10.2002 164.3248 56.5408 101.7837 50.9670 50.3790 15.5832 38.0593 38.2441 8.8985 15.8926 24.6722 9.7240 22.8241 8.7925 5.8374 5.0347 0.7246 11.7098 22.7317 40.9810 40.8033 14.8742 26.2670 15.9355 7.1753
temp: 298.150 k
press: 1.00000 atm
elementType: 8 8 8 7 7 6 6 6 6 6 6 6 6 6 6 6 6 6 6 6 6 6 6 6 6 6 1 1 1 1 1 1 1 1 1 1 1 1 1 1 1 1 1 1 1 1 1 1 1 1
symmnumber: 1
zpe: 1072257.4 jmol-1
zpe.correction: 0.408401 hartree
zpe.thermalcorrener: 0.432237 hartree
zpe.thermalcorrenthalpy: 0.433181 hartree
zpe.thermalcorrgfe: 0.351620 hartree
zpe.sumelectzpe: -1147.903530 hartree
zpe.sumelectthermal: -1147.879694 hartree
zpe.sumelectthermalent: -1147.878750 hartree
zpe.sumelectthermalfe: -1147.960311 hartree
dipole: 1.1860 -1.4753 3.2267
dipole: 3.7409
quadrupole: -128.2605 -144.7607 -155.9727
quadrupole: -8.2814 -7.1020 0.7259
quadrupole: 14.7375 -1.7627 -12.9747 -8.2814 -7.1020 0.7259
hfenergy: -1148.3119316 hartree
pointgroup: C01 [X(C21H24N2O3)]
dipole: 0.4144378 -0.6207929 1.2684816 debye
polarizability: 295.4694362|-10.9701328|251.2534868|-27.7894635|-0.4221877|174.7223948 unknown
InChI: InChI=1S/C21H24N2O3/c1-26-21(25)19(15-17-10-6-3-7-11-17)23-13-12-22-18(20(23)24)14-16-8-4-2-5-9-16/h2-11,18-19,22H,12-15H2,1H3
charge 0 multiplicity 1
50 atoms
O  0.183503 -0.304381 -1.847866
O  3.924609 -2.812425 -0.438793
O  1.840513 -3.621995 0.203457
N  0.792357 -0.998715 0.30029
N  -1.506857 0.195525 1.256987
C  -1.559274 -0.421721 -0.087704
C  0.295932 -1.474836 1.611848
C  2.197896 -1.168601 -0.093532
C  -0.632043 -0.429583 2.272258
C  -0.129082 -0.559562 -0.645449
C  -2.433797 0.439289 -1.034447
C  3.181327 -0.273614 0.735092
C  -3.893749 0.451519 -0.607956
C  2.588279 -2.65647 -0.069781
C  3.115253 1.195247 0.340825
C  -4.732164 -0.665061 -0.870665
C  -4.448565 1.562276 0.080419
C  4.111538 1.742748 -0.50847
C  2.066163 2.040581 0.785389
C  -6.081567 -0.674153 -0.455019
C  -5.800051 1.55802 0.498579
C  4.06387 3.098062 -0.904836
C  2.014919 3.395744 0.390633
C  -6.621079 0.43817 0.234149
C  3.013555 3.930748 -0.455162
C  4.408339 -4.213115 -0.528719
H  -1.995129 -1.456416 -0.072438
H  -0.233549 -2.435876 1.472895
H  1.155048 -1.679082 2.271655
H  2.249122 -0.848747 -1.154646
H  -0.019714 0.350831 2.769644
H  -1.206062 -0.950617 3.070455
H  -2.438868 0.45357 1.598802
H  -2.317391 0.030837 -2.053562
H  -2.01493 1.460899 -1.042731
H  4.200184 -0.661615 0.567017
H  2.954427 -0.402279 1.811474
H  -4.325035 -1.525173 -1.417488
H  -3.819163 2.440018 0.273527
H  4.929586 1.101646 -0.860499
H  1.277737 1.64006 1.431527
H  -6.71459 -1.541897 -0.673592
H  -6.211409 2.427882 1.023541
H  4.843287 3.503116 -1.560308
H  1.194209 4.031983 0.740845
H  -7.669444 0.434136 0.553135
H  2.973404 4.982347 -0.760838
H  3.826399 -4.765397 -1.285146
H  5.463063 -4.126245 -0.823741
H  4.305391 -4.716179 0.447244
