program: Gaussian 09
title: 000131887
version: EM64L-G09RevD.01
frameworkgroup: C1[X(C16H17N3O2)]
method: RPBEPBE
basis: SDD
operation: Freq
keyword: #p
keyword: freq=noraman
keyword: PBEPBE/SDD
title: #p freq=noraman PBEPBE/SDD
converged: YES YES NO NO
title: Mulliken charges:
elementType: O O N N N C C C C C C C C C C C C C C C C H H H H H H H H H H H H H H H H H
charge: -0.264582 -0.311108 -0.404898 -0.369947 -0.053715 0.369393 0.179042 0.279332 -0.552427 -0.418535 -0.460829 -0.025844 0.159480 -0.802429 -0.679463 0.250079 0.033198 -0.363115 -0.343656 -0.210966 -0.222250 0.212554 0.202521 0.244430 0.254293 0.240062 0.361175 0.327804 0.242404 0.236010 0.248720 0.217422 0.226419 0.219295 0.258355 0.256683 0.233275 0.231817
chargesum: 0.00000
title: Mulliken charges with hydrogens summed into heavy atoms:
elementType: O O N N N C C C C C C C C C C C C C C C C
charge: -0.264582 -0.311108 -0.043723 -0.042144 -0.053715 0.369393 0.179042 0.279332 -0.137351 -0.174105 0.033527 -0.025844 0.159480 -0.075294 -0.016326 0.250079 0.033198 -0.104760 -0.086973 0.022309 0.009567
polarizability: 3.32112698e+02 1.28082198e+01 2.01375322e+02 1.08199327e+01 -1.47877546e+00 1.04530240e+02
1716.lowfreq: -12.4869 -5.7880 -0.0006 0.0004 0.0007 1.7443 14.6542 19.7980 35.7979
frequency: 13.9421 19.6755 35.7402 46.2984 70.0422 93.9320 103.4278 118.5340 153.4049 158.9543 203.8526 211.6371 215.4129 251.3106 282.4116 301.0663 318.6087 342.7293 359.4159 417.6154 427.9175 429.5518 469.3821 481.3680 504.9032 549.5066 572.7265 577.1328 590.8181 610.7876 635.0962 657.1677 684.9466 703.8903 718.2323 726.3053 752.1663 763.2290 764.4414 781.4788 801.3543 840.7660 848.1105 864.2261 865.3326 876.3487 945.1140 962.8809 983.1897 992.2862 995.2177 1003.3834 1038.0027 1053.1919 1063.2933 1084.4525 1108.0992 1131.6787 1159.4464 1167.6021 1183.3426 1215.1041 1217.1312 1230.1007 1247.6625 1255.3180 1279.6339 1280.8757 1308.0946 1315.5864 1352.5709 1386.5390 1393.9571 1402.2074 1403.1769 1428.0193 1434.6085 1459.4924 1466.5058 1469.6651 1473.4368 1477.3327 1482.5255 1496.4413 1499.3069 1563.0331 1598.0674 1606.6737 1617.2978 1622.3785 1636.2778 2891.0018 2964.4922 2978.0888 2987.8089 2989.1168 3030.5307 3034.9427 3075.3764 3082.0645 3113.7803 3125.9847 3140.8891 3158.1533 3175.8127 3183.4255 3501.5562 3509.3032
redmass: 5.1101 4.7103 4.6830 2.6605 3.8707 1.6581 3.4836 2.6761 3.2581 3.4306 4.2673 1.1773 4.0788 6.1571 3.6325 4.2407 3.2742 2.2790 5.1378 5.6074 3.0370 3.1607 5.5977 5.2310 5.2074 5.6558 2.6094 1.5589 2.6683 6.9758 5.3275 5.2232 4.8535 5.5170 1.6684 3.5397 2.5497 3.0069 1.6617 1.2272 6.0238 5.2958 1.5926 1.3976 7.6098 3.3950 1.3805 2.1218 1.3082 1.7826 1.6926 2.0205 1.4665 1.4844 2.0525 3.2633 3.3969 2.2450 1.5842 2.3037 2.3579 1.5768 1.5813 2.3054 2.6337 1.4226 1.8307 1.9484 1.6074 1.5727 1.6751 1.2192 2.5520 4.4741 1.2370 3.5010 3.0940 2.6669 1.1136 1.0468 1.0480 1.1039 1.0474 1.1920 1.7584 8.3759 7.3515 3.9703 7.9363 8.0193 7.3594 1.0701 1.0406 1.0350 1.0871 1.0609 1.0981 1.1005 1.0999 1.1009 1.0936 1.0905 1.0865 1.0916 1.0961 1.0990 1.0770 1.0765
irintensity: 1.3985 0.0916 0.6946 0.3308 2.3244 0.2143 0.3757 0.8728 0.7923 6.5692 0.5236 0.3406 5.0384 0.5207 0.8228 4.2182 0.8967 0.0481 21.1646 3.3820 6.3168 7.5843 1.3611 4.9287 5.0012 0.3899 17.8919 45.7227 16.4599 1.1772 0.9038 3.9214 6.6873 1.5312 37.7553 13.1904 34.7175 32.0589 91.1857 3.5388 44.6508 15.8789 40.4613 0.0780 1.0567 9.7887 4.3006 6.1417 0.0083 1.2652 3.9559 9.6729 5.9877 5.3251 13.7099 19.2294 3.0514 57.4323 3.1097 5.9006 21.2913 2.9434 2.3757 15.6139 14.2086 4.1781 7.4964 15.0840 7.3793 16.4703 38.2161 12.4953 134.5829 9.8097 2.3271 1.6611 46.2595 6.4786 6.0866 13.5369 18.2367 119.9654 0.9272 74.8347 141.7124 28.5404 508.0680 137.4201 10.4607 5.1180 130.7783 66.0531 69.3880 39.6226 21.8217 38.0869 20.5709 11.5339 60.6179 45.0823 13.4235 29.5570 3.4180 14.0351 10.3771 10.0603 86.7015 35.7871
temp: 298.150 k
press: 1.00000 atm
elementType: 8 8 7 7 7 6 6 6 6 6 6 6 6 6 6 6 6 6 6 6 6 1 1 1 1 1 1 1 1 1 1 1 1 1 1 1 1 1
symmnumber: 1
zpe: 793409.6 jmol-1
zpe.correction: 0.302194 hartree
zpe.thermalcorrener: 0.321453 hartree
zpe.thermalcorrenthalpy: 0.322397 hartree
zpe.thermalcorrgfe: 0.251745 hartree
zpe.sumelectzpe: -933.112401 hartree
zpe.sumelectthermal: -933.093142 hartree
zpe.sumelectthermalent: -933.092198 hartree
zpe.sumelectthermalfe: -933.162850 hartree
dipole: 1.6813 1.4252 1.0150
dipole: 2.4265
quadrupole: -80.3358 -126.4866 -127.7756
quadrupole: 2.4419 0.3700 -0.9123
quadrupole: 31.1969 -14.9540 -16.2429 2.4419 0.3700 -0.9123
hfenergy: -933.4145949 hartree
pointgroup: C01 [X(C16H17N3O2)]
dipole: -0.6404928 0.6712781 -0.2248296 debye
polarizability: 330.9237203|-19.5763036|192.9635474|10.5252047|28.1487651|114.1309927 unknown
InChI: InChI=1S/C16H17N3O2/c1-3-11-8-13(16(20)18-10(11)2)17-9-15-19-12-6-4-5-7-14(12)21-15/h4-8,17-18H,3,9H2,1-2H3
charge 0 multiplicity 1
38 atoms
O  2.378183 -0.440353 -0.612547
O  -1.616678 -2.650877 -0.395604
N  -0.370195 -0.2302 -0.116336
N  -3.721112 -1.607916 -0.432304
N  2.794867 1.446526 0.67238
C  -4.021641 0.769057 -0.286993
C  -4.5858 -0.501146 -0.403042
C  -1.748812 -0.23479 -0.209872
C  -4.861752 2.036821 -0.206792
C  -2.58698 0.884873 -0.191969
C  0.407117 0.998363 -0.068381
C  -2.324577 -1.582961 -0.347586
C  1.874553 0.727736 0.057186
C  -6.057773 -0.836911 -0.485797
C  -5.288052 2.387994 1.243925
C  3.769421 -0.396121 -0.350172
C  4.024958 0.767127 0.429522
C  4.759446 -1.298053 -0.755166
C  5.340699 1.066404 0.83689
C  6.076733 -0.984811 -0.341005
C  6.360612 0.173063 0.438329
H  -4.275892 2.879518 -0.621547
H  -5.764464 1.954072 -0.840787
H  -2.158658 1.890227 -0.104083
H  0.11906 1.630407 0.796077
H  0.227804 1.615963 -0.980751
H  0.087901 -1.141237 -0.224991
H  -4.120814 -2.546925 -0.529262
H  -6.389826 -1.424286 0.393176
H  -6.288024 -1.433743 -1.390413
H  -6.672611 0.074388 -0.522913
H  -5.864515 3.331296 1.271828
H  -4.403173 2.505183 1.895303
H  -5.915839 1.587619 1.676647
H  4.532792 -2.185325 -1.351649
H  5.553452 1.955193 1.43728
H  6.896802 -1.651407 -0.627933
H  7.395591 0.372431 0.735251
