program: Gaussian 09
title: 000131875
version: EM64L-G09RevD.01
frameworkgroup: C1[X(C11H13N5O)]
method: RPBEPBE
basis: SDD
operation: Freq
keyword: #p
keyword: freq=noraman
keyword: PBEPBE/SDD
title: #p freq=noraman PBEPBE/SDD
converged: YES YES NO NO
title: Mulliken charges:
elementType: O N N N N N C C C C C C C C C C C H H H H H H H H H H H H H
charge: -0.334809 -0.349936 -0.383319 -0.499722 -0.110627 -0.617330 -0.477345 0.233062 0.466756 -0.164306 0.191383 -0.302423 -0.350350 -0.425853 -0.220794 -0.275316 0.122757 0.218798 0.247161 0.298779 0.223206 0.233691 0.339181 0.229953 0.304544 0.251942 0.254768 0.245820 0.311536 0.338793
chargesum: 0.00000
title: Mulliken charges with hydrogens summed into heavy atoms:
elementType: O N N N N N C C C C C C C C C C C
charge: -0.334809 -0.051157 -0.044138 -0.195178 -0.110627 0.032998 -0.011386 0.233062 0.466756 0.058899 0.191383 -0.068732 -0.120397 -0.173912 0.033974 -0.029496 0.122757
polarizability: 2.43909935e+02 -1.50372962e+01 1.51612438e+02 -7.13825138e+00 1.82472409e+01 1.23402691e+02
1716.lowfreq: -87.0769 -10.5479 -5.3686 -0.0003 0.0004 0.0006 3.0083 16.8984 26.8511
frequency: -87.0646 16.6010 26.7891 28.2423 71.3468 77.5965 98.0354 101.4037 140.3182 194.9583 243.7690 283.6724 287.7539 331.4435 341.8738 374.8376 399.5526 448.6666 477.4086 488.8641 533.1015 572.8347 605.2999 612.3812 639.5943 691.4571 694.1763 707.8022 728.9537 736.2815 737.7301 776.9874 811.3290 817.4664 828.8357 875.0729 876.9279 912.0703 951.5545 961.3194 974.3389 992.6482 1003.0209 1021.2797 1045.5114 1071.3079 1085.0931 1123.2413 1170.1291 1180.9416 1199.2110 1244.1459 1256.3786 1280.4263 1287.7610 1308.9971 1316.7914 1341.9709 1368.5632 1411.8021 1412.9539 1415.8467 1440.9865 1446.6799 1487.1407 1540.6848 1543.4977 1578.9661 1583.2692 1634.6230 1659.0942 3008.0245 3076.4991 3083.6400 3107.5190 3197.6345 3218.9750 3227.2284 3244.3192 3558.4036 3562.0546 3582.5738 3590.3501 3731.1197
redmass: 1.2021 5.3806 4.3638 4.7824 5.4925 3.3572 4.6535 3.5743 3.9502 4.3624 3.9871 6.0169 3.9509 2.5246 3.6713 4.4978 1.1565 3.1886 3.6426 1.5995 2.9977 1.1742 3.0555 4.6443 3.4523 4.9973 7.1373 1.2192 3.5754 1.3489 3.1187 5.1598 1.4297 1.4577 2.2171 1.3495 5.3990 3.2439 2.8637 1.1536 2.8434 2.5630 2.6892 2.9993 1.3107 1.9473 2.5894 1.2982 2.7275 1.9640 1.8029 1.4881 1.4085 2.0909 1.3367 2.0551 1.6806 1.5884 1.7064 3.4029 4.5209 5.2384 4.2502 1.1790 2.0171 4.3541 4.4629 5.9678 1.7645 2.2542 5.9190 1.0615 1.0991 1.0914 1.0913 1.0939 1.0953 1.0981 1.1073 1.0778 1.0810 1.0472 1.0787 1.1051
irintensity: 110.5179 3.5857 11.9731 2.2322 13.0088 1.7491 3.1749 1.1863 5.9702 0.2936 1.5059 13.4326 18.3725 8.7213 18.5827 3.4128 199.7839 4.6866 4.1833 69.5090 53.5013 125.4143 26.0415 0.5202 5.3565 18.4630 6.6948 5.6495 75.4438 131.5805 10.0123 4.3621 29.8045 51.2267 9.2589 0.0344 2.5212 3.8976 15.9215 68.3853 13.9316 4.2506 19.5596 19.5028 30.7264 27.2360 37.0722 91.7649 99.7994 86.9874 13.2728 52.7573 2.8897 24.8176 19.7694 89.7635 47.7553 9.8471 4.4581 8.3888 82.9276 24.6950 33.9728 31.2084 329.6569 121.0195 86.3435 140.2161 52.5482 672.5400 22.1804 57.6636 5.0668 3.7383 32.8494 6.0806 4.3149 4.6884 2.8166 17.5955 78.7904 129.4247 27.9407 42.9846
temp: 298.150 k
press: 1.00000 atm
elementType: 8 7 7 7 7 7 6 6 6 6 6 6 6 6 6 6 6 1 1 1 1 1 1 1 1 1 1 1 1 1
symmnumber: 1
zpe: 616794.3 jmol-1
zpe.correction: 0.234925 hartree
zpe.thermalcorrener: 0.250694 hartree
zpe.thermalcorrenthalpy: 0.251638 hartree
zpe.thermalcorrgfe: 0.188352 hartree
zpe.sumelectzpe: -774.720785 hartree
zpe.sumelectthermal: -774.705015 hartree
zpe.sumelectthermalent: -774.704071 hartree
zpe.sumelectthermalfe: -774.767357 hartree
dipole: -0.5337 -2.0314 -1.3627
dipole: 2.5037
quadrupole: -91.7277 -82.8121 -100.0012
quadrupole: -12.7101 -17.8459 11.7255
quadrupole: -0.2140 8.7015 -8.4875 -12.7101 -17.8459 11.7255
hfenergy: -774.9557091 hartree
pointgroup: C01 [X(C11H13N5O1)]
dipole: -0.219258 0.6957813 0.6618885 debye
polarizability: 243.5472022|14.723959|145.1290158|9.5201962|22.0158378|130.248846 unknown
InChI: InChI=1S/C11H13N5O/c12-11-15-7-8(16-11)3-1-6-14-10(17)9-4-2-5-13-9/h1-5,7,13-14,16H,6,12H2
charge 0 multiplicity 1
30 atoms
O  -1.621416 -0.289636 1.695431
N  -1.674929 -1.680476 -0.18353
N  -3.803027 1.171254 0.806872
N  3.5222 0.570798 0.765292
N  4.776685 0.337933 -1.107941
N  5.57005 1.897329 0.567055
C  -0.468624 -2.443148 0.224793
C  -3.307358 0.117372 0.038377
C  2.840459 -0.385103 -0.046492
C  0.824513 -1.872833 -0.329021
C  -2.14491 -0.622104 0.571904
C  1.603219 -1.004273 0.388268
C  -4.106326 0.035314 -1.122546
C  3.652704 -0.494551 -1.186993
C  -4.885228 1.756237 0.173662
C  -5.097341 1.066572 -1.03609
C  4.663538 0.970652 0.086403
H  -0.610071 -3.490968 -0.098742
H  -0.448838 -2.419896 1.327828
H  -2.082905 -1.85425 -1.102995
H  1.105136 -2.151427 -1.354427
H  1.245078 -0.734598 1.393984
H  -3.374906 1.414545 1.702451
H  -3.997284 -0.678631 -1.939058
H  3.1905 0.902327 1.669507
H  3.499495 -1.130715 -2.055852
H  -5.420077 2.59853 0.607165
H  -5.875343 1.285824 -1.76535
H  5.471163 2.351936 1.467832
H  6.36674 2.113387 -0.024186
