program: Gaussian 09
title: 000131869
version: EM64L-G09RevD.01
frameworkgroup: C1[X(C8H7N5O5S)]
method: RPBEPBE
basis: SDD
operation: Freq
keyword: #p
keyword: freq=noraman
keyword: PBEPBE/SDD
title: #p freq=noraman PBEPBE/SDD
converged: YES YES NO NO
title: Mulliken charges:
elementType: S O O O O O N N N N N C C C C C C C C H H H H H H H
charge: 0.365120 -0.183918 -0.201107 -0.185081 -0.259941 -0.275824 -0.089187 0.054937 -0.070430 -0.366010 -0.507859 0.197032 0.184433 0.184287 -0.309992 -0.128487 -0.122115 -0.777004 0.300544 0.301882 0.283598 0.300781 0.291570 0.386079 0.321780 0.304910
chargesum: 0.00000
title: Mulliken charges with hydrogens summed into heavy atoms:
elementType: S O O O O O N N N N N C C C C C C C C
charge: 0.365120 -0.183918 -0.201107 -0.185081 -0.259941 -0.275824 -0.089187 0.054937 -0.070430 0.020069 0.118830 0.197032 0.184433 0.184287 -0.008109 0.155111 -0.122115 -0.184653 0.300544
polarizability: 2.79882540e+02 -2.28060459e+01 2.02773643e+02 -5.21593754e+00 -3.56326353e+00 9.34546100e+01
1716.lowfreq: -7.8715 -5.2168 -1.6197 -0.0014 0.0005 0.0015 19.2339 25.5157 41.6867
frequency: 19.2130 25.4357 41.6817 62.1458 74.2941 99.5457 130.9748 138.1168 158.0379 180.9541 197.6308 207.6496 230.9819 250.9064 286.7561 309.8741 330.7913 337.7629 384.3019 399.3456 437.8419 514.0832 537.4817 568.9990 583.9419 615.7928 632.4821 658.9554 672.3403 718.3463 722.0788 732.2993 756.0562 765.4860 777.8318 859.3681 866.6435 886.7197 887.9256 891.2437 935.4432 945.5389 967.3760 1012.9677 1023.7923 1091.5406 1112.1405 1129.8799 1168.5936 1187.5444 1235.4176 1248.2104 1261.3011 1278.4632 1307.3904 1329.9009 1342.5929 1382.0693 1397.8360 1420.1017 1513.9004 1514.6765 1592.6027 1604.5923 1669.4222 3049.6468 3130.5524 3252.9483 3283.3804 3329.1716 3383.9594 3510.5553
redmass: 7.8646 9.6987 11.3105 7.0157 8.1609 7.7886 8.3025 6.0909 7.0670 6.9950 6.7019 1.5437 7.9351 5.0832 2.9591 6.9518 8.6515 7.2284 3.9043 6.5442 11.9351 10.9502 5.5981 4.7931 5.5768 11.2130 12.7146 5.4650 11.7929 5.0512 6.9121 9.1735 1.1766 1.4173 1.5957 7.6298 12.0444 1.3618 1.8274 11.4644 4.7482 9.7524 7.8149 3.3297 4.8227 3.4416 1.9696 2.5013 3.3253 1.7006 4.1964 1.4627 2.9366 1.2734 2.2315 10.8637 10.3240 8.2978 5.4471 1.1303 1.8655 3.0308 4.8364 11.0948 1.1342 1.0577 1.1079 1.0926 1.1101 1.0843 1.0445 1.0989
irintensity: 3.5138 0.2944 4.4977 4.3293 4.7888 0.1510 0.2657 3.1075 1.7897 6.2527 3.1179 30.2317 0.7925 6.3842 21.3248 8.4758 2.1074 6.0321 14.7029 4.3570 1.1223 0.7999 11.1046 7.9291 6.2986 2.3120 0.1716 13.2548 2.1870 16.9252 14.6152 57.1684 158.5750 46.7780 141.0779 8.5200 2.2817 6.9228 16.3961 9.4652 1.9305 80.8437 18.5095 1.5236 21.0814 1.6920 14.4515 37.2958 42.8110 10.3479 44.6778 27.2519 90.0875 20.2199 2.3323 147.0847 294.6705 19.6779 82.7494 27.6173 22.9913 52.0673 235.9058 96.3584 10.1857 3.9498 1.7270 9.6019 4.5775 28.2732 21.1068 11.3468
temp: 298.150 k
press: 1.00000 atm
elementType: 16 8 8 8 8 8 7 7 7 7 7 6 6 6 6 6 6 6 6 1 1 1 1 1 1 1
symmnumber: 1
zpe: 434040.0 jmol-1
zpe.correction: 0.165317 hartree
zpe.thermalcorrener: 0.182920 hartree
zpe.thermalcorrenthalpy: 0.183864 hartree
zpe.thermalcorrgfe: 0.117185 hartree
zpe.sumelectzpe: -1355.410363 hartree
zpe.sumelectthermal: -1355.392760 hartree
zpe.sumelectthermalent: -1355.391816 hartree
zpe.sumelectthermalfe: -1355.458495 hartree
dipole: -3.7631 2.8479 -1.2161
dipole: 4.8735
quadrupole: -101.2442 -132.3312 -115.7630
quadrupole: 3.9408 -13.1989 3.1279
quadrupole: 15.2019 -15.8851 0.6832 3.9408 -13.1989 3.1279
hfenergy: -1355.5756802 hartree
pointgroup: C01 [X(C8H7N5O5S1)]
dipole: 1.1100249 0.5190568 1.4746917 debye
dipolederiv: -0.4291798 -0.1318194 0.062977 -0.1002155 -0.0449815 0.0176108 0.2199824 -0.063197 0.0499363 -0.5611028 -0.0970534 0.1470729 -0.1511652 -0.1459312 0.0417347 0.3077481 0.0759209 -0.2930626 -0.5123019 -0.106511 0.1472772 -0.1114453 -0.1182414 -0.1262403 0.0787691 -0.2241341 -0.4046673 -0.3948594 -0.0786763 0.0016553 -0.3664365 -0.3883694 -0.2730321 -0.4560208 -0.277936 -0.9282339 -0.3088341 -0.2563965 0.2295061 0.014707 -0.4370291 0.1409166 0.1322075 -0.0569409 -0.4375569 -0.9128533 0.0047228 -0.2554772 0.3893572 -0.4713649 0.1079274 -0.2998886 -0.0211089 -0.4803283 0.1657524 0.2889985 0.3128787 0.1874545 -0.0137503 0.2582556 0.1473726 0.217331 0.200724 0.5243451 0.2300079 -0.6704829 0.3843422 0.6178166 0.1028779 0.2232471 0.4267837 1.6399866 -0.9384145 -0.5000371 -0.4883445 -0.0486663 -0.2252768 -0.0475718 0.4094097 0.2100396 -0.0110429 -0.357735 -0.1398591 -0.1262377 -0.5495289 0.1038597 0.1077554 -0.456961 0.100095 -0.5940544 -0.1952747 -0.2384417 -0.0969581 0.3253692 -0.5622838 -0.2318464 0.0795508 -0.1121781 -0.1109562 0.4080854 0.1319484 0.0375542 0.1038684 0.2407014 0.2370111 -0.210574 0.0805102 0.7098085 0.2242412 0.1757175 0.5378494 0.1248424 0.0820991 0.0377882 0.1446862 -0.1532682 -0.7934816 0.2455032 -0.0059062 -0.0133636 -0.172132 0.0435665 -0.1638094 -0.3712592 -0.2033423 -0.1435552 -0.2168217 -0.0960548 -0.184355 -0.0083774 -0.1813669 -0.0922531 0.1157747 0.1286144 0.0396679 0.0885987 0.07831 -0.0409139 0.0605865 -0.0494687 0.0145109 -0.1164521 -0.0742176 -0.0179119 1.3623792 0.4683396 0.0546046 0.1797674 0.1117127 -0.0576537 -0.4777275 -0.1747647 -0.0987931 0.0842822 -0.0065009 -0.1617277 0.007757 -0.0158643 0.0108116 -0.240939 0.0637209 0.2970911 0.9254357 -0.063465 0.4664527 -0.2100743 0.418855 0.111496 0.8729586 0.0696254 0.4890548 0.1698154 -0.0173621 0.0243458 -0.0302804 0.171467 -0.0252573 -0.0173311 -0.0369281 0.1159384 0.1105464 -0.0559339 0.0148244 -0.0427382 0.1811051 -0.0165447 0.0236308 -0.0212043 0.106352 0.0260222 -0.0652015 0.0315521 -0.0182221 0.0664343 -0.0101731 0.0464718 -0.0205727 0.0758359 0.0074544 0.0879882 -0.041234 0.0615509 0.0597765 -0.0476364 -0.0153058 0.0272496 -0.0288266 0.2260238 0.0994051 -0.082297 0.0624943 0.0709028 -0.1014278 -0.1298127 0.0155932 0.3388586 0.1480305 0.1164262 -0.0869047 -0.0732804 0.2721505 -0.0566366 -0.0197168 -0.0199789 0.1551217 0.1108613 0.1773548 0.1797461 -0.0195344 0.2134809 0.0613868 0.0101793 0.0442875 0.124095 unknown
polarizability: 251.838426|48.8358543|136.3563506|19.0671659|56.9215091|187.9160159 unknown
InChI: InChI=1S/C8H7N5O5S/c9-10-5(14)3-19-8-12-11-7(18-8)6-4(13(15)16)1-2-17-6/h1-2,10H,3,9H2
charge 0 multiplicity 1
26 atoms
S  -2.780524 -1.648078 -2.005821
O  2.805722 1.100907 -1.133315
O  -0.582312 -0.357986 -0.917015
O  0.968213 1.477211 3.035226
O  -0.150869 -0.053935 1.756194
O  -4.616573 0.637769 -0.416134
N  1.026723 -0.662774 -2.519937
N  0.791248 0.828103 1.932992
N  -0.171379 -1.297624 -2.970191
N  -2.849652 0.7012 1.095233
N  -3.064827 2.0798 1.370567
C  1.658502 0.625975 -0.481376
C  1.709752 1.080728 0.852401
C  0.761795 -0.131122 -1.312484
C  2.911402 1.862016 1.020452
C  3.553457 1.844777 -0.197251
C  -1.090944 -1.099145 -2.010957
C  -3.21408 -1.366089 -0.160694
C  -3.624427 0.07008 0.144747
H  3.225315 2.348735 1.939318
H  4.47884 2.267253 -0.576193
H  -4.08704 -2.024632 -0.023761
H  -2.370391 -1.729926 0.445457
H  -1.929378 0.337728 1.392473
H  -3.69876 2.45818 0.648953
H  -3.444813 2.212349 2.318116
