program: Gaussian 09
title: 000010610
version: EM64L-G09RevD.01
frameworkgroup: C1[X(C19H22N2O3S)]
method: RPBEPBE
basis: SDD
operation: Freq
keyword: #p
keyword: freq=noraman
keyword: PBEPBE/SDD
title: #p freq=noraman PBEPBE/SDD
converged: YES YES NO NO
title: Mulliken charges:
elementType: S O O O N N C C C C C C C C C C C C C C C C C C C H H H H H H H H H H H H H H H H H H H H H H
charge: 0.238988 -0.292685 -0.286380 -0.264777 -0.377976 -0.112520 0.494948 0.492006 -0.352574 -0.349017 -0.368128 -0.305388 -0.294015 -0.279976 0.246401 -0.263274 -0.265178 -0.246084 -0.253093 -0.233670 -0.243227 -0.241311 -0.265908 -0.617501 -0.606997 0.230762 0.201564 0.223903 0.201116 0.279224 0.272272 0.249681 0.249140 0.205910 0.199732 0.249731 0.216935 0.231360 0.276660 0.232086 0.231554 0.223569 0.234852 0.191146 0.230172 0.193169 0.222799
chargesum: 0.00000
title: Mulliken charges with hydrogens summed into heavy atoms:
elementType: S O O O N N C C C C C C C C C C C C C C C C C C C
charge: 0.238988 -0.292685 -0.286380 -0.264777 -0.377976 -0.112520 0.494948 0.492006 -0.352574 -0.349017 0.064198 -0.026163 -0.021743 0.145043 0.246401 -0.013593 -0.016037 0.159558 0.213572 -0.002310 0.033433 -0.009224 -0.034354 0.032066 0.039143
polarizability: 3.16857236e+02 -9.91430049e+00 2.43569457e+02 -2.25055959e+01 2.73623304e+01 1.83337899e+02
1716.lowfreq: -7.0598 -0.0006 0.0007 0.0008 2.6431 3.9282 13.0746 26.6892 35.8900
frequency: 12.6893 26.6325 35.8663 49.5728 53.7548 64.9424 73.9164 78.8324 89.0085 107.1364 142.4260 154.4894 162.8542 196.0853 199.1478 224.8329 228.8273 238.1229 244.7365 264.7548 295.2173 318.3444 328.3337 344.2531 346.8366 364.3299 374.7564 400.0300 428.8633 439.3161 451.1978 457.3931 458.9902 517.2836 521.3955 525.1353 553.6941 622.2388 649.6473 675.3252 687.8241 690.7616 717.5760 726.0895 757.3991 769.0091 777.8473 791.7389 809.0362 822.1276 857.1056 861.9100 866.4366 925.0292 939.0232 947.2516 969.4116 980.1389 990.6714 1002.7406 1021.6900 1022.3666 1027.8593 1031.3837 1032.8860 1051.0737 1059.8103 1067.1792 1075.7455 1085.4554 1095.8112 1121.1293 1125.9580 1136.0264 1145.7992 1172.7324 1175.2700 1181.0714 1191.2117 1205.3364 1224.7566 1237.5555 1243.7117 1260.7902 1262.8677 1280.0346 1281.0112 1302.9419 1322.2324 1357.4288 1367.3020 1373.4218 1380.9866 1404.0441 1419.9525 1426.5768 1433.1320 1444.8952 1458.3487 1459.8815 1461.4947 1462.7370 1464.9703 1474.4855 1475.2286 1479.6783 1484.7241 1491.3461 1576.0825 1585.2588 1590.2946 1601.0921 1628.7306 2856.6155 2860.7583 2876.1563 2932.0872 2947.0847 2992.4417 3002.6068 3018.4767 3024.4718 3030.1768 3041.8275 3081.6937 3086.1990 3088.8633 3113.0044 3135.7012 3139.2981 3148.8067 3159.6059 3166.2776 3166.3714 3194.5133
redmass: 4.3335 4.6961 3.4591 6.8395 4.4996 5.4812 5.0091 3.3558 4.2679 4.0365 3.2209 3.5254 3.3210 3.2411 5.5670 4.8792 1.3784 1.4877 1.6669 3.5943 3.1277 3.9059 3.5270 5.1693 2.2928 7.7572 8.1516 6.7008 5.8105 3.2259 3.2392 2.5440 3.8258 4.7105 4.1408 3.7338 4.6414 6.5496 6.1495 6.8094 8.6593 7.4055 4.2543 3.9357 1.3371 2.6516 1.7315 3.7247 1.4555 3.8249 1.3902 1.8522 1.4997 4.2398 1.4438 1.3891 3.5107 1.3255 3.5533 1.3294 5.8099 2.2861 3.8965 1.6640 2.8952 2.1111 2.7672 3.6975 1.7909 1.6303 1.7773 2.3122 1.6867 1.6609 1.5282 1.1323 1.5754 1.5042 1.5549 1.1546 1.4654 1.7902 1.1810 2.3672 2.5744 1.3217 1.6855 2.2322 1.3048 1.4744 1.4626 9.5536 10.7637 1.4481 1.1543 2.2204 2.1884 1.1750 1.6081 1.4034 1.0508 1.0905 1.0827 1.0775 2.1352 1.1157 1.0561 1.0796 6.5691 6.4152 7.0372 7.0125 10.8738 1.0564 1.0656 1.0610 1.0557 1.0566 1.1045 1.0986 1.0653 1.0736 1.0730 1.0895 1.1014 1.1009 1.1060 1.0910 1.0857 1.0891 1.0916 1.0962 1.0985 1.0972 1.0954
irintensity: 0.2502 0.3141 1.4099 0.7725 2.3120 2.7302 0.4943 1.6898 1.5512 2.2158 0.0842 10.3445 2.8182 2.3025 2.5425 1.4157 1.5717 2.4943 1.5392 2.8143 3.2359 6.1492 10.1114 1.4759 13.7977 1.0222 0.8288 2.0789 3.4550 0.4732 12.4208 4.7852 10.3405 5.7967 0.5161 7.7199 2.0186 8.2560 7.3735 6.5453 6.8774 4.0083 0.7242 9.9926 64.1728 19.8105 72.0081 25.0503 1.2960 6.8111 0.9266 7.9873 1.4844 2.1934 3.5338 0.6368 51.8864 0.0130 17.9957 0.7791 16.5399 11.1515 128.1684 20.1756 8.3673 5.1155 82.3447 58.4647 25.2253 1.3624 13.6376 21.3981 7.4930 32.8174 2.4672 31.9229 11.5892 116.7162 120.6373 13.9251 2.6305 29.2026 8.6080 240.1279 12.6493 16.5695 50.3513 130.0839 11.1767 45.8774 5.9164 7.9764 4.7183 0.1275 3.1408 9.2307 21.9133 1.2437 73.6744 104.5313 18.3518 11.7784 2.5034 12.9368 22.2378 20.9776 15.2802 7.8500 25.1619 7.3672 1.5714 54.6502 272.1212 74.3481 47.0657 254.1441 37.5036 80.2100 75.4829 12.1244 67.7377 35.4081 37.8980 46.2417 19.9327 53.8013 14.9601 3.7690 1.2388 3.3032 11.3453 17.6892 27.5125 4.0874 2.2092
temp: 298.150 k
press: 1.00000 atm
elementType: 16 8 8 8 7 7 6 6 6 6 6 6 6 6 6 6 6 6 6 6 6 6 6 6 6 1 1 1 1 1 1 1 1 1 1 1 1 1 1 1 1 1 1 1 1 1 1
symmnumber: 1
zpe: 983433.0 jmol-1
zpe.correction: 0.374570 hartree
zpe.thermalcorrener: 0.398786 hartree
zpe.thermalcorrenthalpy: 0.399730 hartree
zpe.thermalcorrgfe: 0.318511 hartree
zpe.sumelectzpe: -1468.580760 hartree
zpe.sumelectthermal: -1468.556544 hartree
zpe.sumelectthermalent: -1468.555600 hartree
zpe.sumelectthermalfe: -1468.636819 hartree
dipole: 4.2390 -1.0459 0.1689
dipole: 4.3694
quadrupole: -129.7258 -152.7468 -150.1361
quadrupole: 4.8988 -7.7210 -2.3379
quadrupole: 14.4771 -8.5439 -5.9332 4.8988 -7.7210 -2.3379
hfenergy: -1468.9553302 hartree
pointgroup: C01 [X(C19H22N2O3S1)]
dipole: -1.6754401 -0.3731971 -0.0933368 debye
polarizability: 316.1218261|12.2466523|250.4943736|-24.1219553|-16.1038339|177.148393 unknown
InChI: InChI=1S/C19H22N2O3S/c1-20(2)11-12-23-13-14-24-19(22)21-15-7-3-5-9-17(15)25-18-10-6-4-8-16(18)21/h3-10H,11-14H2,1-2H3
charge 0 multiplicity 1
47 atoms
S  2.933659 -1.862237 1.115032
O  -3.052041 1.958045 0.682562
O  -0.29494 1.566883 1.46899
O  1.345311 2.888065 0.453392
N  1.307538 0.533579 0.182894
N  -5.088622 -0.711299 -0.879447
C  2.612322 0.466902 -0.445826
C  0.526376 -0.687314 0.25826
C  3.46948 -0.616008 -0.124235
C  1.159478 -1.893281 0.641578
C  -4.514187 0.647751 -0.717196
C  3.038663 1.433417 -1.388078
C  -0.838937 -0.711065 -0.116957
C  -4.105647 0.934007 0.736806
C  0.833121 1.762551 0.672275
C  4.7422 -0.728387 -0.72298
C  0.435724 -3.105272 0.680196
C  -2.51427 2.299463 2.004251
C  -1.080523 2.77389 1.818114
C  4.321367 1.333342 -1.967926
C  -1.573947 -1.913559 -0.053271
C  5.17605 0.256819 -1.636989
C  -0.936432 -3.112683 0.34717
C  -6.348651 -0.893927 -0.124722
C  -5.254128 -1.060218 -2.308345
H  -3.597972 0.707983 -1.332685
H  -5.208514 1.446747 -1.080778
H  -3.705815 0.005184 1.196712
H  -4.959706 1.299353 1.346964
H  2.380869 2.269913 -1.630284
H  -1.330351 0.222644 -0.40429
H  5.383829 -1.579788 -0.473819
H  0.946464 -4.030926 0.965223
H  -2.523753 1.412652 2.672055
H  -3.119953 3.105445 2.472436
H  -0.99455 3.520198 1.009371
H  -0.676434 3.204633 2.75258
H  4.649225 2.096109 -2.681917
H  -2.639125 -1.907279 -0.31776
H  6.168771 0.177092 -2.092367
H  -1.50064 -4.05048 0.389076
H  -6.718504 -1.924025 -0.271396
H  -6.172967 -0.75158 0.955496
H  -7.15602 -0.186156 -0.443252
H  -4.280164 -0.98686 -2.823793
H  -5.98074 -0.398511 -2.843872
H  -5.611513 -2.101515 -2.39665
