program: Gaussian 09
title: 000131863
version: EM64L-G09RevD.01
frameworkgroup: C1[X(C15H16O4S)]
method: RPBEPBE
basis: SDD
operation: Freq
keyword: #p
keyword: freq=noraman
keyword: PBEPBE/SDD
title: #p freq=noraman PBEPBE/SDD
converged: YES YES NO NO
title: Mulliken charges:
elementType: S O O O O C C C C C C C C C C C C C C C H H H H H H H H H H H H H H H H
charge: 0.925394 -0.273561 -0.533991 -0.545072 -0.197645 -0.210650 -0.422704 0.028304 -0.669013 -0.547711 -0.106951 0.147764 -0.274969 -0.396185 0.477796 -0.443835 -0.363270 -0.218186 -0.219033 -0.234315 0.283185 0.318530 0.227085 0.308177 0.292689 0.268365 0.293219 0.245653 0.261985 0.211605 0.201719 0.231930 0.240454 0.230803 0.229604 0.232830
chargesum: 0.00000
title: Mulliken charges with hydrogens summed into heavy atoms:
elementType: S O O O O C C C C C C C C C C C C C C C
charge: 0.925394 -0.273561 -0.533991 -0.545072 -0.197645 0.072535 -0.104174 0.255389 -0.068147 0.013874 0.138702 0.147764 -0.012984 0.017139 0.477796 -0.211905 -0.122816 0.012617 0.010570 -0.001484
polarizability: 2.41973447e+02 -1.21265071e+01 2.18155212e+02 -1.59799757e+01 -5.50117280e+00 1.46613561e+02
1716.lowfreq: -11.8458 -5.2263 -0.0016 -0.0008 0.0009 5.5869 13.5822 18.5802 36.9281
frequency: 12.8065 17.1748 36.9080 48.1648 68.4548 88.1988 116.6990 126.6146 139.7112 168.6177 196.9596 234.4243 239.3275 241.6613 260.0387 293.9303 353.3108 371.4425 401.9165 402.7196 409.0247 432.6146 460.5769 479.2352 482.9309 557.0746 577.4003 590.2335 616.6631 618.0069 671.5035 700.6005 707.9533 750.5730 798.9058 805.7968 820.1227 835.3780 852.0921 859.9881 888.9285 900.9679 912.5795 925.3756 954.5044 976.5788 984.7215 990.2039 992.8680 998.2908 1000.2827 1003.4394 1025.3983 1033.3893 1082.2642 1088.3845 1096.9847 1102.8202 1131.6183 1152.0523 1173.8637 1179.5288 1186.7363 1195.3540 1215.4218 1225.3405 1244.1450 1257.0126 1272.4290 1310.5663 1318.8416 1330.1871 1339.8626 1361.7382 1372.8856 1384.2794 1390.7184 1421.4664 1441.9594 1446.4118 1475.6386 1486.6470 1587.6308 1597.0492 1607.7711 1617.4454 2926.1697 2934.1067 2981.4528 2998.8595 3001.4838 3064.2089 3068.9342 3104.7118 3120.4448 3129.2807 3134.7936 3141.3157 3152.6127 3161.6206 3164.7345 3167.4449
redmass: 3.8045 4.9098 6.3620 9.7007 4.1285 4.9272 5.8874 5.8046 4.8123 5.8354 7.1279 4.5265 5.9153 4.0949 4.8328 3.4724 3.5513 5.5538 3.4418 3.9552 3.3517 5.3829 4.6850 4.3949 4.8675 4.3390 4.8286 3.5868 6.2747 3.1523 3.7188 1.9302 3.7653 1.6706 1.7826 12.8025 3.0162 2.3949 1.2538 2.7935 3.8887 4.2529 1.5833 2.6900 2.7220 1.3936 2.1338 3.7127 2.1034 1.3531 1.4353 2.2570 2.3636 3.6614 1.8156 1.5935 1.5125 1.6515 1.5379 1.2464 1.0565 1.1820 1.1094 1.1066 1.6035 2.3344 1.4645 1.8491 1.2917 1.3775 1.3637 1.4191 1.4039 1.4652 1.7503 2.0499 3.3788 1.1130 2.1215 1.0888 1.1233 2.2693 9.3281 6.1351 6.6013 6.1486 1.0616 1.0834 1.0691 1.0996 1.0823 1.0553 1.0873 1.0929 1.0874 1.0864 1.0877 1.0915 1.0963 1.1123 1.0985 1.1016
irintensity: 0.2795 0.9104 0.1313 7.3583 2.0709 1.4984 1.2012 5.2229 4.8355 11.4879 1.4262 1.4150 4.0130 0.8325 5.6375 5.9535 2.3199 10.1507 5.4321 8.7231 16.6773 42.6606 0.1272 2.3608 7.8592 1.3498 23.7903 7.1005 0.3898 1.7904 7.2583 41.8888 4.9446 69.0464 37.8077 120.2262 5.3394 9.4138 0.3834 12.1243 13.5623 4.2273 13.0665 10.7002 59.8283 0.0729 8.9656 1.0836 14.1463 3.7349 0.8175 33.6624 47.7419 134.2285 3.2703 10.5461 7.0979 12.4098 3.0574 18.2328 0.3084 12.0555 0.9291 11.8151 3.9202 9.3272 34.2679 17.1667 9.1751 5.5724 11.5618 2.2079 28.4565 3.7437 10.4738 21.7668 4.4297 12.5406 12.8570 10.5268 9.5382 5.0676 110.9414 0.8451 114.8177 0.5473 38.4903 41.4827 0.4840 28.1611 9.7711 0.4635 4.2671 1.6275 7.3467 0.2039 4.3512 15.5046 36.3698 0.4641 8.9850 18.5342
temp: 298.150 k
press: 1.00000 atm
elementType: 16 8 8 8 8 6 6 6 6 6 6 6 6 6 6 6 6 6 6 6 1 1 1 1 1 1 1 1 1 1 1 1 1 1 1 1
symmnumber: 1
zpe: 728409.2 jmol-1
zpe.correction: 0.277436 hartree
zpe.thermalcorrener: 0.296282 hartree
zpe.thermalcorrenthalpy: 0.297226 hartree
zpe.thermalcorrgfe: 0.227097 hartree
zpe.sumelectzpe: -1278.493708 hartree
zpe.sumelectthermal: -1278.474863 hartree
zpe.sumelectthermalent: -1278.473919 hartree
zpe.sumelectthermalfe: -1278.544048 hartree
dipole: -5.0065 -1.0282 -3.8326
dipole: 6.3884
quadrupole: -127.3659 -144.1236 -124.8865
quadrupole: 12.3262 -13.7905 -10.3408
quadrupole: 4.7594 -11.9983 7.2388 12.3262 -13.7905 -10.3408
hfenergy: -1278.7711449 hartree
pointgroup: C01 [X(C15H16O4S1)]
dipole: 2.0287837 0.5097027 -1.3933033 debye
polarizability: 239.2522567|-16.8579531|216.476105|15.8024702|16.2354891|151.0138584 unknown
InChI: InChI=1S/C15H16O4S/c16-12-6-7-15-13(8-12)14(10-20(15,17)18)19-9-11-4-2-1-3-5-11/h1-7,13-15H,8-10H2
charge 0 multiplicity 1
36 atoms
S  -2.918749 1.830758 0.482689
O  0.837994 0.301773 -0.07498
O  -3.67358 1.183039 1.778072
O  -3.348617 3.295154 -0.104436
O  -2.580051 -3.489934 0.333312
C  -1.422062 -0.166026 -0.810106
C  -2.789229 0.460302 -1.097238
C  -0.422189 0.960758 -0.41365
C  -0.978336 1.791406 0.759106
C  -1.515894 -1.286031 0.257861
C  -3.956984 -0.43976 -1.098638
C  -2.657861 -2.271411 0.000121
C  -3.897002 -1.716753 -0.601525
C  1.985559 1.237339 0.046601
C  3.263998 0.427863 0.061159
C  4.231967 0.632882 1.07378
C  3.516958 -0.528335 -0.954835
C  5.443257 -0.096528 1.066515
C  4.72161 -1.263256 -0.95878
C  5.690696 -1.046354 0.049774
H  -1.048214 -0.609508 -1.754371
H  -2.785509 1.206161 -1.909154
H  -0.272039 1.62656 -1.294365
H  -0.847958 1.299079 1.734258
H  -0.685324 2.850536 0.772023
H  -1.717101 -0.848606 1.257872
H  -0.565495 -1.836475 0.331101
H  -4.893581 -0.054671 -1.518971
H  -4.760924 -2.389214 -0.646782
H  1.892601 1.836688 0.974631
H  1.959531 1.932971 -0.822275
H  4.039724 1.359806 1.872719
H  2.759571 -0.705426 -1.726428
H  6.185699 0.070479 1.8546
H  4.906583 -2.004254 -1.744413
H  6.62655 -1.61601 0.045253
