program: Gaussian 09
title: 000131860
version: EM64L-G09RevD.01
frameworkgroup: C1[X(C11H10Br2N4O)]
method: RPBEPBE
basis: SDD
operation: Freq
keyword: #p
keyword: freq=noraman
keyword: PBEPBE/SDD
title: #p freq=noraman PBEPBE/SDD
converged: YES YES NO NO
title: Mulliken charges:
elementType: Br Br O N N N N C C C C C C C C C C C H H H H H H H H H H
charge: 0.026868 0.043563 -0.213277 -0.413365 -0.451177 -0.007421 0.011325 -0.500264 0.600442 0.414503 0.166495 -0.527986 -0.239726 -0.486944 0.097764 -0.769676 -0.143374 -0.309259 0.243774 0.220687 0.326686 0.336074 0.287862 0.261417 0.232623 0.290719 0.232869 0.268797
chargesum: 0.00000
title: Mulliken charges with hydrogens summed into heavy atoms:
elementType: Br Br O N N N N C C C C C C C C C C C
charge: 0.026868 0.043563 -0.213277 -0.086679 -0.115103 -0.007421 0.011325 -0.035804 0.600442 0.414503 0.166495 -0.527986 0.048136 -0.225527 0.097764 -0.013465 -0.143374 -0.040462
polarizability: 2.39741147e+02 -1.07343389e+01 1.99881947e+02 1.80015063e+01 1.44060060e+01 1.24733134e+02
1716.lowfreq: -3.6568 0.0004 0.0005 0.0007 4.2422 6.3349 13.2860 16.8561 35.4141
frequency: 12.9871 16.6737 35.3888 53.1493 80.4462 81.3198 111.9181 150.9232 158.2968 174.3290 188.3520 200.7463 241.8610 253.4689 279.2434 290.7046 300.4128 334.2778 406.3771 444.8867 498.3500 514.9542 521.6700 555.1826 564.4156 587.3401 593.7146 611.7611 638.1122 647.6800 694.7043 714.3316 746.7548 854.6747 884.7384 893.3395 929.5859 934.1446 959.9625 981.9598 999.6415 1019.6309 1046.6900 1055.7377 1082.6234 1091.1673 1135.2430 1201.3876 1223.3726 1228.4778 1257.5134 1301.3688 1307.4016 1338.3071 1378.2619 1393.3075 1411.9761 1419.6528 1428.9296 1449.2531 1470.8627 1471.2722 1485.4661 1533.1279 1571.8056 1590.6830 1611.0774 1639.1353 2932.5786 2973.8410 2984.2203 3063.2090 3128.0738 3140.8280 3157.9979 3160.0181 3506.7768 3544.8076
redmass: 10.1145 12.1668 7.5710 6.6702 1.0980 4.6453 6.2905 5.8067 5.3797 4.7413 4.4223 3.7835 8.0772 8.0567 6.7021 10.5822 3.4756 4.4807 3.8540 4.3929 4.9691 3.5426 1.5058 1.4038 3.7374 3.9726 4.4931 7.0733 8.3748 8.5762 4.9175 2.6085 10.7175 4.5155 2.0336 3.9871 1.3591 1.4211 2.5798 2.2424 5.1160 3.3960 1.5417 3.3523 2.5472 4.9588 2.4099 3.5292 1.2150 1.8658 2.3764 2.7547 1.7918 1.6564 1.8906 1.2481 1.9351 2.2792 2.8026 1.2788 1.4265 1.2068 1.1185 6.1024 6.0766 6.3507 5.8005 5.8236 1.0567 1.1037 1.0397 1.0981 1.0917 1.0965 1.0931 1.0942 1.0772 1.0777
irintensity: 0.0891 4.8710 2.6255 2.5984 0.0917 0.4031 2.2879 1.2846 0.7726 2.7385 2.4255 1.4074 0.6216 1.5261 0.0694 4.3778 3.7604 1.2250 7.3477 11.2193 21.6185 37.8285 123.4079 9.9591 9.0755 9.0023 2.9298 8.0044 1.5411 17.6869 19.7140 24.3982 16.2043 41.2821 71.8257 46.2360 1.6039 0.2122 9.6963 1.9629 32.0707 13.5863 4.5156 11.4165 30.3511 26.2968 3.0898 1.2639 10.9032 25.8588 54.9328 1.8404 11.2394 8.3995 29.8102 39.5032 44.3307 153.2816 30.5190 58.3090 39.4536 23.9643 14.9375 15.9495 20.0920 201.2148 380.3881 723.8397 46.7126 25.6434 17.2882 15.4790 16.5536 1.7630 4.0082 0.5060 40.3425 27.6477
temp: 298.150 k
press: 1.00000 atm
elementType: 35 35 8 7 7 7 7 6 6 6 6 6 6 6 6 6 6 6 1 1 1 1 1 1 1 1 1 1
symmnumber: 1
zpe: 519651.0 jmol-1
zpe.correction: 0.197925 hartree
zpe.thermalcorrener: 0.215588 hartree
zpe.thermalcorrenthalpy: 0.216532 hartree
zpe.thermalcorrgfe: 0.147364 hartree
zpe.sumelectzpe: -745.013932 hartree
zpe.sumelectthermal: -744.996269 hartree
zpe.sumelectthermalent: -744.995325 hartree
zpe.sumelectthermalfe: -745.064493 hartree
dipole: 5.2389 7.8171 -0.0548
dipole: 9.4104
quadrupole: -169.2623 -114.7577 -124.9276
quadrupole: -30.8845 -5.4086 -4.7764
quadrupole: -32.9464 21.5582 11.3883 -30.8845 -5.4086 -4.7764
hfenergy: -745.2118565 hartree
pointgroup: C01 [X(C11H10Br2N4O1)]
dipole: 2.2366808 -2.8624052 -0.714976 debye
polarizability: 240.716632|13.9212312|184.9154701|-4.2504168|35.1727668|138.7241265 unknown
InChI: InChI=1S/C11H10Br2N4O/c1-6-16-10(9(13)11(18)17-6)15-4-7-2-8(12)5-14-3-7/h2-3,5,15-16H,4H2,1H3
charge 0 multiplicity 1
28 atoms
Br -1.547723 2.927472 0.125477
Br 4.74006 1.339244 2.334517
O  -4.508704 1.935859 0.785196
N  -0.12424 0.153261 -0.377851
N  -2.036278 -1.234575 -0.003742
N  -4.197082 -0.390897 0.59092
N  4.510604 -0.511702 -1.445278
C  0.781377 -0.960959 -0.688844
C  -1.466528 0.043966 -0.064945
C  2.237798 -0.544988 -0.531881
C  -3.395452 -1.39818 0.330827
C  -2.303882 1.129168 0.203399
C  2.691297 0.10929 0.642582
C  3.186174 -0.826276 -1.544111
C  -3.721959 0.981472 0.542561
C  -3.890313 -2.82575 0.372302
C  4.056654 0.437711 0.740402
C  4.942763 0.11336 -0.314813
H  0.625481 -1.346128 -1.719455
H  0.583116 -1.800915 0.011252
H  0.214413 1.109042 -0.518694
H  -1.478316 -2.059317 -0.229061
H  1.992577 0.353177 1.449153
H  2.883581 -1.319759 -2.475489
H  -3.788607 -3.320543 -0.612195
H  -4.953322 -2.813309 0.649116
H  -3.33739 -3.426794 1.118604
H  6.008001 0.358068 -0.259148
