program: Gaussian 09
title: 000131857
version: EM64L-G09RevD.01
frameworkgroup: C1[X(C24H21N3O2)]
method: RPBEPBE
basis: SDD
operation: Freq
keyword: #p
keyword: freq=noraman
keyword: PBEPBE/SDD
title: #p freq=noraman PBEPBE/SDD
converged: YES YES NO NO
title: Mulliken charges:
elementType: O O N N N C C C C C C C C C C C C C C C C C C C C C C C C H H H H H H H H H H H H H H H H H H H H H
charge: -0.435920 -0.234271 -0.223065 -0.095425 -0.027770 -0.293708 -0.490426 -0.485646 0.262406 0.011390 -0.574809 -0.065958 0.290679 0.515519 -0.286941 -0.372616 -0.362481 -0.461191 -0.814341 -0.385654 -0.398526 0.347984 0.267045 0.077359 -0.387516 -0.330295 -0.227289 -0.230750 0.072460 0.258553 0.260417 0.236087 0.289477 0.240446 0.237257 0.273192 0.225437 0.234708 0.249504 0.232234 0.229778 0.267666 0.230731 0.241671 0.243003 0.256031 0.276967 0.235023 0.237907 0.383665
chargesum: 0.00000
title: Mulliken charges with hydrogens summed into heavy atoms:
elementType: O O N N N C C C C C C C C C C C C C C C C C C C C C C C C
charge: -0.052255 -0.234271 -0.223065 -0.095425 -0.027770 -0.035155 0.006078 0.044278 0.262406 0.011390 -0.064360 -0.065958 0.290679 0.515519 -0.061505 -0.137908 -0.112977 -0.228957 -0.086166 -0.143983 -0.155523 0.347984 0.267045 0.077359 -0.131485 -0.053328 0.007734 0.007158 0.072460
polarizability: 4.14596359e+02 -7.10529958e+00 2.72294172e+02 -2.09505779e+01 -8.61701524e+00 2.05025009e+02
1716.lowfreq: -55.0121 -2.6792 -0.0005 0.0005 0.0008 3.6188 6.1400 19.2883 20.9401
frequency: -55.0104 19.2384 20.8871 36.1311 46.5211 50.7223 55.5285 63.3950 84.1096 99.0194 116.4942 130.5398 139.3715 159.4759 172.2233 207.7022 237.3332 239.3234 241.3962 272.5824 279.4727 316.4931 322.4663 343.8641 368.0132 396.2522 405.1028 415.9630 424.4400 484.5603 507.9693 530.6547 535.0551 545.6188 554.1535 580.0654 591.4369 594.1434 604.0134 621.0399 637.4695 644.0227 679.7429 700.5678 708.0361 725.5245 748.3869 760.8431 769.6580 773.0180 789.5313 790.9485 798.6348 804.9039 822.1732 828.9859 834.7259 847.8337 853.0660 878.3710 895.4547 903.2892 939.9658 945.1284 960.9474 972.9996 976.2184 990.8565 997.7266 999.8530 1001.6732 1022.0291 1040.5773 1043.2027 1050.1250 1050.9449 1071.7917 1074.3987 1092.3014 1096.5704 1113.4272 1122.7358 1157.2030 1158.6865 1173.7355 1178.2046 1193.2059 1202.2578 1212.8807 1226.1797 1242.4317 1260.6003 1266.3508 1281.2332 1291.9019 1303.2453 1310.9373 1319.9127 1344.2265 1359.0831 1371.8770 1381.4007 1392.8712 1394.9086 1410.3755 1423.0849 1429.4926 1435.2494 1457.8663 1461.8891 1469.8478 1472.6385 1475.1483 1477.7385 1508.1153 1514.4491 1567.2066 1569.3458 1580.9845 1602.8849 1603.5963 1625.0079 1639.4487 2981.6485 2982.2752 3031.5327 3058.7630 3100.3768 3105.2013 3107.8624 3115.1219 3126.9837 3130.6988 3132.6421 3142.0192 3147.5278 3150.7923 3152.7904 3155.4287 3162.1842 3181.5976 3207.0068 3225.4360 3522.1112
redmass: 1.0245 5.7626 5.2718 6.1399 6.7484 3.7437 4.5175 4.8434 4.3286 3.6664 4.6723 4.1671 4.1305 5.6169 4.7270 4.5702 3.9253 3.8312 3.8430 3.5781 5.5032 4.9203 4.5565 3.6331 5.1096 5.2352 2.8914 3.6454 4.2821 5.4707 4.2849 3.9211 3.7669 4.8993 3.3304 5.6727 3.7197 1.5880 2.7000 4.8540 6.3865 5.0210 4.4337 4.2636 6.2883 3.7323 3.9886 3.2631 2.1774 2.1484 8.0668 2.2457 1.7984 2.4161 3.1716 1.2320 1.6914 1.2681 4.9083 2.0365 1.4259 3.6004 1.3672 1.6175 1.6642 1.4470 1.3823 5.1534 4.0339 2.1576 1.3777 2.7541 3.5471 1.5402 2.0205 1.2428 1.5561 1.1603 1.5679 1.2925 1.6847 1.4574 3.5312 1.7799 1.3862 1.0674 1.1662 2.3585 2.1811 2.5809 2.5027 1.7370 1.9965 1.8871 2.3279 2.4046 1.4110 3.0811 2.2919 3.0349 6.3866 2.5571 1.2803 2.8730 3.0877 2.5591 2.2681 1.1069 1.2328 1.3857 1.7239 2.3269 1.4894 1.0472 6.3542 2.9084 7.5714 7.2766 7.0685 6.2937 7.4055 6.3780 8.6597 1.0579 1.0386 1.1028 1.0972 1.0513 1.0986 1.0606 1.0877 1.0875 1.0874 1.0861 1.0956 1.0912 1.0971 1.0907 1.0968 1.0969 1.0970 1.1181 1.1158 1.0641
irintensity: 0.4227 0.0304 0.1081 0.2207 2.0552 0.7074 0.0743 0.3806 0.0731 0.6278 3.0185 0.1480 3.5061 3.8471 1.7825 0.9473 1.3248 0.4084 1.3821 0.7184 0.3317 1.1573 2.7617 5.3031 3.0169 1.8511 0.0517 8.1796 2.1971 3.2131 3.1722 16.0452 2.1175 6.9350 18.5926 2.5441 2.4013 74.4221 45.4126 14.0101 1.5981 3.4323 22.6842 40.5201 4.7047 6.0420 6.8762 20.5685 50.8046 6.9386 0.6252 21.3386 5.8277 11.4753 11.5134 38.4503 35.3170 0.9571 1.5637 21.2481 0.3615 16.2571 0.1603 4.1477 0.2899 23.1854 1.6526 179.0101 73.0671 26.3953 1.8026 5.7084 9.6342 6.2105 18.8247 31.9179 4.1134 21.7480 18.5220 9.0870 34.3648 26.0460 14.0023 73.2410 6.9547 0.1243 0.9927 6.7057 19.5213 14.7596 42.4584 5.2957 9.0102 58.5596 8.6424 58.0038 6.9885 20.4971 9.3991 28.0304 3.0606 23.1682 22.9651 5.1439 21.7024 100.0874 9.2335 9.3634 5.7424 7.8182 32.2304 14.6240 50.4866 12.7063 151.2438 5.1147 8.8786 29.9253 1.8519 7.5077 74.6520 4.7287 312.0394 41.1012 19.2088 13.7976 17.8314 17.8116 6.0775 4.9606 14.8992 11.0695 5.3805 3.1116 20.6143 13.4229 1.5527 11.0486 42.4923 19.9184 11.2990 1.9557 8.3860 37.4800
temp: 298.150 k
press: 1.00000 atm
elementType: 8 8 7 7 7 6 6 6 6 6 6 6 6 6 6 6 6 6 6 6 6 6 6 6 6 6 6 6 6 1 1 1 1 1 1 1 1 1 1 1 1 1 1 1 1 1 1 1 1 1
symmnumber: 1
zpe: 1030218.8 jmol-1
zpe.correction: 0.392390 hartree
zpe.thermalcorrener: 0.416630 hartree
zpe.thermalcorrenthalpy: 0.417574 hartree
zpe.thermalcorrgfe: 0.336134 hartree
zpe.sumelectzpe: -1239.839519 hartree
zpe.sumelectthermal: -1239.815279 hartree
zpe.sumelectthermalent: -1239.814334 hartree
zpe.sumelectthermalfe: -1239.895775 hartree
dipole: -3.6547 -0.3420 -0.0508
dipole: 3.6710
quadrupole: -145.4745 -163.1584 -161.6729
quadrupole: 3.8214 -3.8896 -7.0847
quadrupole: 11.2941 -6.3898 -4.9043 3.8214 -3.8896 -7.0847
hfenergy: -1240.2319088 hartree
pointgroup: C01 [X(C24H21N3O2)]
dipole: 1.4390701 -0.1212071 0.0194364 debye
polarizability: 405.3808142|-45.9789856|213.8759443|-9.7975842|13.3676152|272.6587816 unknown
InChI: InChI=1S/C24H21N3O2/c1-15-12-13-25-23-21(15)26-22(18-10-11-18)27(23)14-16-6-8-17(9-7-16)19-4-2-3-5-20(19)24(28)29/h2-9,12-13,18,28H,10-11,14H2,1H3
charge 0 multiplicity 1
50 atoms
O  3.905402 -0.017919 -3.36476
O  2.358207 -1.159211 -2.075075
N  -2.597201 -0.33742 0.984974
N  -3.742702 -0.300919 -1.006874
N  -3.846183 1.39552 2.211476
C  -1.805915 -1.887628 -0.858725
C  -2.205095 -2.669548 -2.12435
C  -1.115891 -1.607804 -2.224596
C  -2.725715 -0.869938 -0.317324
C  -3.601818 0.633607 1.123672
C  -1.635889 -0.681018 2.045818
C  -4.305275 0.643771 -0.126581
C  -5.390099 1.54053 -0.281069
C  -0.176571 -0.54757 1.622595
C  -5.664324 2.353397 0.851847
C  -4.896337 2.258702 2.043722
C  0.244324 0.488708 0.753045
C  0.786466 -1.468266 2.098703
C  -6.186204 1.613556 -1.565454
C  1.585869 0.574717 0.339154
C  2.135865 -1.37292 1.697166
C  2.548771 -0.367168 0.787433
C  3.975603 -0.275847 0.353201
C  4.386794 -0.232329 -1.018579
C  4.978246 -0.163613 1.352414
C  5.75596 -0.028629 -1.344469
C  6.338686 0.009687 1.021213
C  6.729802 0.09324 -0.334808
C  3.434978 -0.519386 -2.132973
H  -1.190541 -2.409793 -0.122116
H  -3.185389 -2.424561 -2.54147
H  -1.91964 -3.724459 -2.170053
H  -0.065336 -1.896369 -2.313254
H  -1.387468 -0.662612 -2.703105
H  -1.827847 -1.708745 2.409335
H  -1.871569 0.010707 2.878363
H  -6.488147 3.074892 0.814532
H  -5.127537 2.897961 2.902459
H  -0.48722 1.21664 0.3852
H  0.478803 -2.277505 2.772922
H  -6.137963 2.626133 -2.007956
H  -5.795257 0.892099 -2.300465
H  -7.253858 1.387057 -1.386106
H  1.894345 1.377395 -0.340286
H  2.863647 -2.112445 2.050435
H  4.670767 -0.180124 2.403634
H  6.040645 0.011185 -2.399071
H  7.086038 0.096879 1.817544
H  7.781097 0.243033 -0.601563
H  3.261074 -0.282869 -4.075377
