program: Gaussian 09
title: 000131856
version: EM64L-G09RevD.01
frameworkgroup: C1[X(C13H15ClFNO)]
method: RPBEPBE
basis: SDD
operation: Freq
keyword: #p
keyword: freq=noraman
keyword: PBEPBE/SDD
title: #p freq=noraman PBEPBE/SDD
converged: YES YES NO NO
title: Mulliken charges:
elementType: Cl F O N C C C C C C C C C C C C C H H H H H H H H H H H H H H H
charge: -0.018322 -0.206429 -0.251587 -0.089114 -0.334240 -0.434315 -0.300568 -0.425268 -0.627249 0.501639 -0.286469 -0.287780 0.206760 -0.371918 -0.389172 0.341756 -0.490372 0.274930 0.162213 0.196253 0.245023 0.222018 0.204012 0.234531 0.206354 0.229770 0.225210 0.187437 0.259846 0.282485 0.256642 0.275923
chargesum: 0.00000
title: Mulliken charges with hydrogens summed into heavy atoms:
elementType: Cl F O N C C C C C C C C C C C C C
charge: -0.018322 -0.206429 -0.251587 -0.089114 0.102903 0.006961 0.125462 0.015616 0.015168 0.501639 -0.286469 -0.027934 0.206760 -0.089432 -0.132530 0.341756 -0.214449
polarizability: 2.00187111e+02 5.52576279e+00 1.77006071e+02 1.11025874e+01 -6.83017217e+00 9.10490760e+01
1716.lowfreq: -5.3138 -1.4588 -0.0017 -0.0016 -0.0015 2.9323 16.3566 24.8331 27.4359
frequency: 15.8266 24.7658 27.4136 61.8395 86.7336 97.2384 120.9236 149.2086 153.6165 181.1513 186.1866 212.9144 221.7064 245.8880 313.6318 322.9317 330.8503 356.3978 362.3410 377.9240 407.1732 440.3420 442.2663 495.7308 538.5594 564.1933 567.2583 631.3759 665.5736 667.3087 702.8391 717.4583 784.9444 795.1340 821.3404 855.3213 863.0422 901.2706 915.5222 925.7949 945.4002 973.8870 1025.7712 1031.1743 1035.2667 1091.2483 1097.5971 1115.6852 1135.5496 1146.2153 1164.5679 1188.2556 1210.1542 1245.8533 1252.3539 1252.7505 1260.8569 1301.5127 1330.4071 1352.4675 1360.2311 1373.7239 1390.8694 1404.3442 1433.4239 1451.5115 1459.1730 1466.8666 1469.5937 1479.1477 1481.0495 1485.3399 1584.4171 1611.6147 2147.0814 2819.9086 2828.2673 2850.6622 2951.2583 2996.1304 3003.6081 3017.4015 3029.1908 3056.4643 3074.5767 3087.5292 3164.5901 3184.4840 3187.4730 3427.2733
redmass: 6.2078 5.5492 6.8005 4.5075 3.8138 2.8808 3.4759 6.2306 2.6770 4.2997 7.7085 1.8432 1.8338 2.4927 5.9146 3.2349 2.6944 4.1815 4.9388 4.0841 5.3576 4.4979 3.5548 3.9631 5.3926 3.6966 4.5597 1.2309 1.6753 3.0282 3.5708 2.7494 1.9928 1.4975 2.8509 1.4516 5.1778 1.8240 1.4431 3.5890 3.2339 1.7260 2.6996 2.9174 2.1076 1.6841 2.1397 1.5427 1.3898 2.1289 2.2060 1.5178 1.2470 3.9659 1.4431 1.4858 1.6266 1.1593 1.3680 1.4089 2.5328 2.0027 1.4203 4.8077 1.1675 1.0823 1.0794 1.4472 1.0605 1.0536 1.0880 1.7545 7.9212 7.5346 6.0191 1.0714 1.0691 1.0589 1.0557 1.0660 1.0847 1.1038 1.0720 1.0874 1.0985 1.0997 1.0878 1.0964 1.0939 1.1597
irintensity: 0.0797 0.0448 0.1471 0.4111 0.6401 1.0621 1.4386 2.9342 0.5517 1.6720 0.4452 2.0627 4.2809 0.6981 0.6936 3.5383 10.8513 3.2458 1.2856 0.3638 4.0135 6.0560 4.5770 0.0964 0.7901 5.9808 2.2335 76.3291 61.3588 21.1178 0.8518 36.0556 40.2489 36.9995 20.7665 40.7288 52.7630 2.6984 0.1517 45.4689 4.5550 4.8917 15.0931 36.0785 57.1101 5.5077 14.0535 11.5284 10.6556 24.1721 117.7007 15.4287 4.3066 146.4214 16.3707 25.5019 0.7780 9.1534 13.6597 15.6714 9.7105 30.5140 0.2171 1.1083 4.9443 8.2982 7.1141 211.9248 9.5002 11.4342 19.3672 112.2899 23.7421 1.9775 0.2581 53.7588 81.7015 202.1115 35.3887 20.5797 22.9750 43.4128 51.3936 4.5444 28.0911 35.1596 7.1841 1.1134 1.6041 51.9172
temp: 298.150 k
press: 1.00000 atm
elementType: 17 9 8 7 6 6 6 6 6 6 6 6 6 6 6 6 6 1 1 1 1 1 1 1 1 1 1 1 1 1 1 1
symmnumber: 1
zpe: 651881.7 jmol-1
zpe.correction: 0.248289 hartree
zpe.thermalcorrener: 0.266317 hartree
zpe.thermalcorrenthalpy: 0.267261 hartree
zpe.thermalcorrgfe: 0.199536 hartree
zpe.sumelectzpe: -1192.878110 hartree
zpe.sumelectthermal: -1192.860082 hartree
zpe.sumelectthermalent: -1192.859138 hartree
zpe.sumelectthermalfe: -1192.926863 hartree
dipole: -2.1776 -3.8332 0.9404
dipole: 4.5078
quadrupole: -111.7728 -94.6891 -110.6992
quadrupole: 3.8775 -4.9486 -0.0187
quadrupole: -6.0524 11.0313 -4.9788 3.8775 -4.9486 -0.0187
hfenergy: -1193.126399 hartree
pointgroup: C01 [X(C13H15Cl1F1N1O1)]
dipole: 0.7501546 1.4968405 0.5848037 debye
polarizability: 200.0904079|7.5833619|174.8790093|-6.8724486|16.8631314|93.2728408 unknown
InChI: InChI=1S/C13H15ClFNO/c1-3-7-16(2)8-4-9-17-13-6-5-11(15)10-12(13)14/h1,5-6,10H,4,7-9H2,2H3
charge 0 multiplicity 1
32 atoms
Cl -1.104629 -2.270458 -0.952532
F  -5.798866 -0.47802 0.361615
O  -0.343312 0.543184 -0.453711
N  3.8777 0.619089 0.134388
C  2.442564 0.792987 0.461396
C  1.736208 1.772499 -0.498558
C  0.236972 1.882985 -0.215541
C  4.460661 -0.611081 0.739877
C  4.706155 1.797801 0.461304
C  -1.705318 0.365826 -0.23016
C  -2.224129 -0.943258 -0.433573
C  -2.600212 1.388604 0.17938
C  3.792861 -1.85211 0.303833
C  -3.583773 -1.236847 -0.240768
C  -3.971727 1.115225 0.37993
C  -4.432979 -0.190917 0.165199
C  3.241179 -2.900931 -0.034479
H  1.951558 -0.190438 0.366328
H  2.299755 1.137752 1.521024
H  2.164721 2.791043 -0.418218
H  1.894414 1.426725 -1.535751
H  -0.24363 2.616506 -0.894251
H  0.045268 2.18165 0.83695
H  5.527356 -0.656651 0.445321
H  4.440793 -0.576751 1.861532
H  4.337959 2.683504 -0.082768
H  5.748295 1.621012 0.139877
H  4.715046 2.04268 1.555097
H  -2.232756 2.404819 0.342908
H  -3.975241 -2.244667 -0.398531
H  -4.666169 1.898581 0.695132
H  2.750977 -3.807541 -0.33905
