program: Gaussian 09
title: 000131847
version: EM64L-G09RevD.01
frameworkgroup: C1[X(C19H24N4O3S)]
method: RPBEPBE
basis: SDD
operation: Freq
keyword: #p
keyword: freq=noraman
keyword: PBEPBE/SDD
title: #p freq=noraman PBEPBE/SDD
converged: YES YES NO NO
title: Mulliken charges:
elementType: S O O O N N N N C C C C C C C C C C C C C C C C C C C H H H H H H H H H H H H H H H H H H H H H H H H
charge: 0.970580 -0.280228 -0.529535 -0.522263 -0.184536 -0.332084 -0.380874 -0.547168 -0.054521 -0.401005 -0.342884 -0.416451 -0.472014 0.469122 -0.388247 -0.376149 0.167940 -0.223094 -0.232241 0.282349 -0.268721 -0.330405 -0.337077 0.369564 -0.369577 -0.307003 -0.731614 0.258907 0.195868 0.219224 0.217352 0.203673 0.211620 0.197317 0.265952 0.245003 0.237332 0.303022 0.218360 0.226960 0.219291 0.216813 0.225303 0.281491 0.207324 0.234457 0.251999 0.288339 0.274432 0.281379 0.286717
chargesum: 0.00000
title: Mulliken charges with hydrogens summed into heavy atoms:
elementType: S O O O N N N N C C C C C C C C C C C C C C C C C C C
charge: 0.970580 -0.280228 -0.529535 -0.522263 -0.184536 -0.066132 -0.077852 -0.258828 0.204386 0.014087 0.078141 -0.007514 0.010322 0.469122 -0.169887 -0.149189 0.167940 -0.003803 -0.015428 0.282349 -0.043417 -0.048914 -0.129752 0.369564 -0.135120 -0.055004 0.110914
polarizability: 4.20337085e+02 4.71687020e+01 2.90210507e+02 -1.59755748e+01 -1.39933943e+01 2.08086267e+02
1716.lowfreq: -8.6389 -4.8121 -0.0022 -0.0009 0.0001 3.5748 9.0565 11.6025 19.5774
frequency: 8.4555 10.7061 19.3633 23.2148 31.2262 43.1796 46.8766 59.7731 67.3740 87.6188 115.6311 130.7116 144.2655 161.0530 162.7002 171.8003 183.6033 207.8029 232.5741 254.8800 267.2440 278.4281 298.5400 302.9872 316.4050 329.6228 336.2205 377.6717 397.9811 404.4923 408.4024 420.0120 429.0073 452.6000 481.6189 487.8092 500.3718 516.3293 525.2993 544.3293 580.2428 608.9491 614.1902 624.0881 630.4940 678.3857 690.7606 720.7229 735.6116 755.8842 757.5476 767.9830 807.7858 812.0485 817.0344 827.2984 850.2999 858.9662 867.1795 870.1137 899.2450 905.5170 911.3202 948.4383 954.5056 956.4970 975.5236 977.8265 982.7283 990.7772 993.8860 997.3095 1016.1841 1024.4628 1029.9403 1059.3820 1073.6449 1087.9041 1100.8271 1115.8295 1119.8339 1148.9219 1159.8142 1171.0172 1181.5648 1189.8871 1198.0365 1212.4779 1220.9525 1223.6275 1241.4875 1245.7205 1260.0382 1276.5551 1313.7215 1314.7383 1318.2765 1323.2037 1330.1583 1335.9089 1350.9667 1363.8952 1370.6606 1382.9548 1394.4186 1395.7692 1412.9870 1417.5274 1421.6874 1435.8977 1445.1291 1454.9705 1457.7771 1462.7069 1466.4534 1474.4510 1494.3076 1502.5969 1555.4897 1578.5531 1593.5363 1609.0333 1617.4701 2875.3792 2890.5028 2901.9557 2921.7255 3005.9612 3037.8140 3044.3138 3050.9023 3072.8893 3095.8557 3120.5588 3125.0785 3127.0155 3127.9606 3148.5365 3155.4761 3166.4222 3167.7550 3178.0435 3184.3743 3195.9655 3329.6869 3432.8543 3575.5136
redmass: 6.1182 5.4796 5.3660 5.7338 5.2501 5.5198 4.5570 3.9666 4.5929 5.1867 3.9779 5.1613 3.1567 1.3183 3.5888 4.3921 4.3995 4.3683 4.4019 4.2012 2.7532 4.3755 3.8169 3.9997 5.2667 3.6997 4.2989 8.0186 2.7810 5.0566 2.9143 3.1443 3.1088 3.0158 2.4722 2.0957 2.8762 2.6679 1.9577 3.2637 7.2414 3.3022 6.3078 6.2337 6.7383 3.6309 1.7877 1.7354 2.8693 2.2386 3.1390 3.5342 6.3802 1.2886 1.6243 3.6691 1.6790 2.7010 1.6021 1.5742 1.9127 2.2465 2.6117 1.4340 1.7131 2.0570 1.3248 4.8711 1.3160 1.3791 2.3945 3.5244 2.8472 1.8320 2.1893 2.0117 2.3403 1.6821 2.5618 1.6814 1.5526 2.8918 3.6857 1.0764 2.8893 1.2622 1.1373 1.2367 1.4231 1.2978 2.3780 1.4352 1.3571 2.1176 1.1825 1.3014 1.3108 1.2963 1.2697 1.3016 1.4461 1.5254 1.9158 3.9826 2.5221 1.7007 1.0521 1.0916 2.9567 1.1574 2.3793 1.1680 1.3366 1.1024 1.1052 1.8810 2.4165 2.3071 6.3844 5.9520 6.7403 6.2755 6.0782 1.0697 1.0708 1.0810 1.0707 1.0587 1.0249 1.0912 1.0894 1.1046 1.0895 1.0844 1.0897 1.0881 1.0898 1.0919 1.0939 1.0947 1.1004 1.0950 1.1074 1.1074 1.0740 1.0745 1.0776
irintensity: 2.2027 1.3921 0.7535 3.0989 4.0535 0.3057 4.3024 0.4718 2.7814 5.1756 8.6872 3.0660 6.4350 1.1736 0.0737 12.2318 4.6325 5.0506 11.0998 2.8387 10.5145 16.2894 4.3569 9.4909 15.2566 4.6857 53.4373 20.1946 5.6774 7.4078 1.9100 13.2836 7.2422 0.1558 18.9328 26.1537 29.5194 13.8926 108.2689 19.4237 65.7450 27.6806 0.3102 15.7757 0.6912 39.1293 44.1848 49.5999 3.9939 63.6501 24.0577 6.1968 48.2009 0.5825 33.2627 8.7388 39.6465 17.6212 106.3548 3.0177 18.4833 17.9065 5.0230 5.6265 11.5710 18.2407 0.3255 7.4412 44.3697 0.6956 9.1541 5.1113 0.6564 31.0354 20.4997 3.1594 20.8193 5.1418 13.4558 6.6628 23.8435 4.0532 58.6498 0.8214 3.6480 25.9481 2.6134 8.0945 24.5320 79.3561 2.6124 113.8926 20.9279 174.7397 2.3337 69.4565 11.7806 4.5940 3.4786 20.6038 8.3436 21.0226 28.3337 14.8250 8.4743 0.6825 12.1812 12.2388 6.7837 41.5038 1.4792 10.4520 11.6941 42.2250 7.1474 241.3878 126.9665 168.6565 46.7474 8.9198 96.2135 8.4824 148.1453 66.7001 65.8166 64.5380 101.2265 39.4800 0.1362 61.7703 25.7372 11.4993 22.7242 9.2762 29.2908 7.2817 2.7516 34.3123 48.1860 2.2851 7.6317 2.2964 0.2526 0.3852 12.5577 1.1018 10.7774
temp: 298.150 k
press: 1.00000 atm
elementType: 16 8 8 8 7 7 7 7 6 6 6 6 6 6 6 6 6 6 6 6 6 6 6 6 6 6 6 1 1 1 1 1 1 1 1 1 1 1 1 1 1 1 1 1 1 1 1 1 1 1 1
symmnumber: 1
zpe: 1067626.7 jmol-1
zpe.correction: 0.406638 hartree
zpe.thermalcorrener: 0.433580 hartree
zpe.thermalcorrenthalpy: 0.434524 hartree
zpe.thermalcorrgfe: 0.343651 hartree
zpe.sumelectzpe: -1578.984612 hartree
zpe.sumelectthermal: -1578.957669 hartree
zpe.sumelectthermalent: -1578.956725 hartree
zpe.sumelectthermalfe: -1579.047599 hartree
dipole: -0.8179 3.8756 -0.5344
dipole: 3.9968
quadrupole: -171.4735 -165.5579 -165.0636
quadrupole: 40.6964 2.0888 -2.3150
quadrupole: -4.1085 1.8071 2.3014 40.6964 2.0888 -2.3150
hfenergy: -1579.3912495 hartree
pointgroup: C01 [X(C19H24N4O3S1)]
dipole: -0.3032749 -1.5385854 0.1159678 debye
polarizability: 421.1464253|-46.178519|290.3254284|16.4209742|-9.5830217|207.162005 unknown
InChI: InChI=1S/C19H24N4O3S/c1-27(25,26)22-16-9-7-15(8-10-16)19(24)21-13-17-14-23(12-11-20-17)18-5-3-2-4-6-18/h2-10,17,20-22H,11-14H2,1H3
charge 0 multiplicity 1
51 atoms
S  7.061296 -0.51892 0.209296
O  0.366805 3.056093 -0.853339
O  8.21249 0.337379 -0.56809
O  6.462932 -0.034537 1.642506
N  -4.329095 0.113339 -0.081866
N  -3.773756 2.87452 0.4458
N  -0.224332 1.659479 0.899671
N  5.498729 -0.912725 -1.032078
C  -2.651304 1.926451 0.266641
C  -3.118339 0.506493 0.661347
C  -5.427567 1.102197 0.041892
C  -4.947661 2.501585 -0.375983
C  -1.472694 2.392645 1.155976
C  -4.631213 -1.262454 -0.254147
C  -5.705057 -1.672121 -1.104159
C  -3.861198 -2.287841 0.375432
C  0.641211 2.06083 -0.106974
C  -5.986963 -3.035884 -1.311683
C  -4.146383 -3.651971 0.150283
C  1.913293 1.272128 -0.281336
C  -5.210619 -4.043936 -0.690938
C  2.663339 1.516833 -1.462025
C  2.408749 0.330811 0.662264
C  4.339438 -0.137276 -0.772512
C  3.869371 0.840427 -1.699021
C  3.599806 -0.374856 0.42102
C  7.683866 -2.304658 0.402525
H  -2.297802 1.89018 -0.79172
H  -3.293762 0.484177 1.765078
H  -2.304654 -0.198545 0.418096
H  -5.781939 1.147831 1.097231
H  -6.277673 0.802295 -0.588955
H  -5.757592 3.232463 -0.198855
H  -4.717473 2.485897 -1.468706
H  -3.477103 3.84598 0.27653
H  -1.27386 3.45972 0.946546
H  -1.748751 2.289623 2.221117
H  -0.019646 0.827423 1.451465
H  -6.303264 -0.923563 -1.633398
H  -3.052847 -2.02933 1.065448
H  -6.813184 -3.313304 -1.976917
H  -3.536632 -4.412854 0.652024
H  -5.431561 -5.10302 -0.858948
H  2.280696 2.263558 -2.164771
H  1.887967 0.148626 1.609666
H  4.451455 1.051893 -2.604701
H  3.972301 -1.103598 1.145751
H  5.923908 -0.663518 -1.949796
H  7.984085 -2.643566 -0.597753
H  6.840135 -2.880516 0.802622
H  8.532258 -2.249185 1.098844
