program: Gaussian 09
title: 000131840
version: EM64L-G09RevD.01
frameworkgroup: C1[X(C22H26O8)]
method: RPBEPBE
basis: SDD
operation: Freq
keyword: #pfreq=noraman
keyword: PBEPBE/SDD
title: #p freq=noraman PBEPBE/SDD
converged: YES YES NO NO
title: Mulliken charges:
elementType: O O O O O O O O C C C C C C C C C C C C C C C C C C C C C C H H H H H H H H H H H H H H H H H H H H H H H H H H
charge: -0.201641 -0.448218 -0.431671 -0.176688 -0.256321 -0.221729 -0.483819 -0.455903 0.215794 -0.096575 -0.137535 -0.020177 -0.781738 0.116777 -0.508543 -0.730709 0.178757 0.125089 0.448595 -0.652207 -0.307455 -0.143474 -0.159938 0.225470 0.073729 0.336306 -0.795458 -0.501822 -0.409615 -0.492614 0.265809 0.247856 0.222702 0.245680 0.235357 0.229064 0.217928 0.248876 0.225263 0.236361 0.282767 0.355390 0.264253 0.371459 0.269275 0.237001 0.237780 0.229633 0.221329 0.194539 0.220906 0.227113 0.238774 0.244045 0.359009 0.365162
chargesum: 0.00000
title: Mulliken charges with hydrogens summed into heavy atoms:
elementType: O O O O O O O O C C C C C C C C C C C C C C C C C C C C C C
charge: -0.201641 -0.092828 -0.060212 -0.176688 -0.256321 -0.221729 -0.124811 -0.090741 0.215794 0.169234 0.110321 -0.020177 -0.077999 0.116777 -0.061550 -0.020210 0.178757 0.125089 0.448595 -0.369441 -0.043201 -0.143474 -0.159938 0.225470 0.073729 0.336306 -0.051401 -0.050861 0.005830 0.217319
polarizability: 4.40596357e+02 -1.15071944e+01 2.89734522e+02 -2.16649845e+01 -1.05959704e+01 1.69803841e+02
1716.lowfreq: -15.3896 -9.3602 -3.3999 -0.0008 0.0006 0.0013 3.5930 8.0252 13.5360
frequency: -9.3088 7.9216 13.4467 30.1507 41.6563 44.8553 45.8089 58.7874 71.1394 90.8066 101.9621 113.0326 120.2595 134.3507 143.6639 159.9359 183.1251 199.0438 200.5951 207.7387 210.0255 216.7596 222.7534 241.8331 247.6417 261.1354 264.7641 268.1132 295.7368 306.2360 316.2598 324.8069 331.2610 334.2754 346.9115 371.4513 375.7553 385.2704 392.2844 401.3040 407.0301 440.5549 454.1814 469.1234 479.3174 486.0637 496.1033 497.8940 522.2805 587.2762 591.9805 596.3287 614.2522 628.7704 646.7007 670.0477 673.3264 720.9290 727.9232 760.3674 768.0157 781.6771 804.2915 823.4445 829.5943 838.0298 852.3571 863.3585 886.4108 911.8538 937.2858 956.2471 958.9073 977.2102 994.0445 995.9028 1002.8420 1022.9654 1030.2736 1033.4572 1034.4178 1041.9139 1054.5516 1092.3776 1101.5409 1101.9565 1116.0263 1141.3465 1147.4921 1152.2886 1154.7660 1168.6385 1172.8981 1186.1325 1189.1040 1202.4019 1204.7612 1227.5085 1238.3592 1262.5605 1272.2639 1292.0439 1300.6302 1312.8781 1323.4106 1334.2982 1337.3379 1347.6891 1361.6885 1373.8840 1383.8324 1387.2758 1389.1299 1394.2605 1400.5160 1439.3659 1440.8613 1441.8948 1442.7146 1452.5431 1454.3400 1456.7428 1459.6200 1461.2503 1462.1065 1463.1849 1464.6441 1471.3442 1483.6035 1488.0867 1521.4183 1529.0595 1579.2839 1592.8665 1619.5513 1682.3351 2922.8041 2966.6610 2971.3704 2983.7505 2989.4488 3000.7998 3007.0637 3007.1879 3008.9073 3009.5477 3043.5362 3050.9090 3055.6922 3086.4387 3090.1449 3095.6420 3107.1058 3113.5522 3116.9351 3121.2599 3128.6977 3129.5327 3347.8500 3555.1454 3560.2087 3578.7324
redmass: 2.9688 5.3755 6.2123 4.6511 4.2731 4.6378 3.3460 5.1062 4.1586 2.4887 2.8540 3.8508 2.1075 4.8653 4.1344 5.4217 3.3026 3.8010 2.7643 2.2449 1.2546 2.2043 1.9040 4.5323 4.0597 4.1036 1.4267 1.9043 4.1029 2.5358 4.8769 1.2332 2.9989 2.0670 4.6263 2.3684 2.4294 3.0929 4.7038 5.5429 1.5654 4.2254 3.1944 7.6509 5.7378 4.2674 4.3232 3.7116 4.7802 5.1545 4.7276 4.1941 4.2309 7.0158 4.6872 2.2609 1.4032 5.8966 5.7236 5.0425 9.6492 3.3639 3.3473 3.9903 3.9190 2.2665 3.9020 2.2029 1.8031 3.1458 2.1801 2.3494 2.1140 3.3833 2.1594 1.8737 3.6219 2.3969 3.5827 1.5410 2.2444 2.8553 2.1419 2.5572 1.4934 1.9821 2.8974 1.7495 1.5653 2.0671 2.1232 2.1026 1.6841 1.3774 1.0609 2.5491 1.1333 1.5062 2.1283 3.4795 1.4487 1.6681 2.0452 3.3323 1.2007 2.1993 1.4751 1.8842 1.5563 1.4982 1.3045 1.3375 1.3552 1.8242 1.8020 1.1903 1.2020 1.3013 3.3368 1.0904 1.0717 1.1751 3.1034 1.1095 1.0530 1.0753 1.0920 1.0677 1.0583 1.0628 9.8678 9.8485 8.0267 9.3740 8.0069 8.0120 1.0683 1.0652 1.0577 1.0375 1.0354 1.0365 1.0792 1.0325 1.0867 1.0912 1.1059 1.0945 1.0956 1.0995 1.1004 1.0985 1.1002 1.0904 1.0990 1.1051 1.0916 1.1060 1.0663 1.0656 1.0663 1.0661
irintensity: 6.4384 0.6818 1.5573 0.4999 0.6346 2.7161 2.9379 2.5811 0.7305 3.6004 0.5034 0.2538 4.5506 2.8137 1.1188 5.6748 4.4573 2.0235 3.1923 0.9468 0.0763 2.2325 0.3325 18.6910 2.5721 7.0599 3.0654 1.4920 9.4977 19.5136 4.5884 125.5997 21.1774 54.7427 7.8652 7.5524 54.8205 20.1340 18.3141 12.8793 129.6597 5.8179 6.8543 4.3935 1.3634 2.9566 6.5464 9.3179 2.8330 6.9627 8.5596 10.8035 2.3878 2.3806 11.0903 45.5574 128.3771 1.4806 5.7709 7.2219 9.0435 10.0941 10.1392 90.8932 10.6916 20.8529 2.6016 54.2193 24.6082 7.2562 70.9991 23.7709 30.7113 43.4579 22.8379 5.8249 167.1925 64.5341 74.1517 1.6395 36.9999 11.8809 110.2275 45.8844 26.2082 61.2023 27.7004 17.4131 42.4003 64.8151 23.4638 15.6220 155.9073 8.9992 23.3972 42.2425 5.3967 41.7420 41.7024 370.1508 43.6883 16.6070 19.0388 160.4290 5.2053 132.6458 13.1816 26.1852 8.8654 31.8971 36.7641 49.1843 23.9167 10.1418 54.2344 24.5282 79.5863 8.0550 48.4260 39.8770 13.7427 55.3263 6.2243 10.8158 15.9391 18.6708 1.2772 10.4989 14.6223 8.4471 81.8939 324.1159 163.8742 60.6802 51.6454 12.0369 86.0464 13.3389 49.0847 13.1524 18.0412 19.2628 22.5588 48.9024 4.8618 47.6759 32.1803 15.4658 12.6011 30.5162 13.3660 30.0727 19.1776 12.7505 4.7622 27.5441 9.6243 29.1740 138.1956 3.4050 2.2276 54.4002
temp: 298.150 k
press: 1.00000 atm
elementType: 8 8 8 8 8 8 8 8 6 6 6 6 6 6 6 6 6 6 6 6 6 6 6 6 6 6 6 6 6 6 1 1 1 1 1 1 1 1 1 1 1 1 1 1 1 1 1 1 1 1 1 1 1 1 1 1
symmnumber: 1
zpe: 1157263.8 jmol-1
zpe.correction: 0.440779 hartree
zpe.thermalcorrener: 0.471387 hartree
zpe.thermalcorrenthalpy: 0.472331 hartree
zpe.thermalcorrgfe: 0.377166 hartree
zpe.sumelectzpe: -1453.422276 hartree
zpe.sumelectthermal: -1453.391668 hartree
zpe.sumelectthermalent: -1453.390723 hartree
zpe.sumelectthermalfe: -1453.485888 hartree
dipole: -0.0503 -4.7946 -0.5997
dipole: 4.8322
quadrupole: -176.9967 -173.1546 -174.9891
quadrupole: -2.5331 18.0711 4.7588
quadrupole: -1.9499 1.8922 0.0577 -2.5331 18.0711 4.7588
hfenergy: -1453.8630544 hartree
pointgroup: C01 [X(C22H26O8)]
dipole: 0.0244745 -1.828462 -0.5200082 debye
polarizability: 440.8087299|-4.3276649|289.8392093|-23.9006411|7.3450565|169.4867802 unknown
InChI: InChI=1S/C22H26O8/c1-10-18(27)16-13(19(28)20(10)29-4)7-14(25)17-21(16)30-11(2)22(17,3)15(26)6-5-12(8-23)9-24/h5,7,11,15,23-26H,6,8-9H2,1-4H3
charge 0 multiplicity 1
56 atoms
O  0.614897 2.172916 0.349818
O  -1.904908 -0.052799 -1.604031
O  -0.462102 -2.424606 0.657295
O  3.308379 2.877563 -0.013089
O  6.672597 -0.448279 -0.379108
O  4.593462 -2.474937 -0.019906
O  -7.504352 -2.101582 -0.774388
O  -7.959832 -0.132447 1.02274
C  -1.209745 0.541225 0.730788
C  -0.905677 2.033264 0.332652
C  -2.326826 -0.067055 -0.190673
C  0.153383 -0.105354 0.459674
C  -1.56752 0.336026 2.228125
C  1.146969 0.897082 0.29837
C  -3.666911 0.697762 -0.164036
C  -1.457163 3.159917 1.197431
C  0.540068 -1.456082 0.471685
C  2.526161 0.594702 0.137133
C  2.872883 -0.791585 0.138866
C  1.902486 -1.801959 0.299974
C  -4.73709 -0.025291 -0.954306
C  3.580088 1.629793 -0.024072
C  4.294365 -1.233698 -0.032283
C  4.989042 1.178679 -0.203917
C  5.321902 -0.170204 -0.211291
C  -6.038614 -0.175354 -0.582878
C  6.05305 2.230822 -0.375013
C  -7.01323 -0.878708 -1.496881
C  -6.606076 0.342729 0.744352
C  7.230914 -1.816238 -0.482634
H  -1.17893 2.169419 -0.731636
H  -2.491949 -1.111527 0.141005
H  -2.490443 0.872823 2.508857
H  -1.715376 -0.738936 2.432645
H  -0.753606 0.698495 2.879804
H  -3.499922 1.698984 -0.612942
H  -3.988126 0.856784 0.880652
H  -1.077347 4.127451 0.82761
H  -2.560307 3.18169 1.149435
H  -1.152012 3.051888 2.251225
H  2.241028 -2.845247 0.292244
H  -1.112491 -0.639848 -1.704222
H  -4.398576 -0.428978 -1.918151
H  -0.074254 -3.334739 0.678204
H  5.594601 3.231057 -0.353239
H  6.59545 2.089167 -1.328278
H  6.813796 2.154571 0.424265
H  -7.883416 -0.227222 -1.718523
H  -6.514532 -1.178336 -2.437186
H  -5.919376 0.061554 1.57397
H  -6.679013 1.447329 0.736569
H  8.304891 -1.6391 -0.649186
H  6.787926 -2.364982 -1.328897
H  7.063876 -2.386177 0.44436
H  -8.226828 -2.524524 -1.30511
H  -8.014165 -1.0752 0.685829
