program: Gaussian 09
title: 000131829
version: EM64L-G09RevD.01
frameworkgroup: C1[X(C11H14BrN5)]
method: RPBEPBE
basis: SDD
operation: Freq
keyword: #p
keyword: freq=noraman
keyword: PBEPBE/SDD
title: #p freq=noraman PBEPBE/SDD
converged: YES YES NO NO
title: Mulliken charges:
elementType: Br N N N N N C C C C C C C C C C C H H H H H H H H H H H H H H
charge: -0.052058 -0.445019 -0.422953 -0.460968 -0.494456 -0.166519 0.490362 0.318653 -0.374367 -0.389232 0.642131 -0.768416 -0.452562 -0.352397 -0.367443 0.287351 -0.457655 0.226112 0.208018 0.220398 0.210167 0.303433 0.290792 0.211584 0.220147 0.219891 0.331591 0.289593 0.221580 0.221548 0.290695
chargesum: 0.00000
title: Mulliken charges with hydrogens summed into heavy atoms:
elementType: Br N N N N N C C C C C C C C C C C
charge: -0.052058 -0.141586 -0.132161 -0.171375 -0.203761 -0.166519 0.490362 0.318653 0.059763 0.041333 0.642131 -0.768416 -0.240978 -0.020806 0.072595 0.287351 -0.014527
polarizability: 2.79907142e+02 4.90604679e+00 1.87814261e+02 -1.72359703e-01 6.31083854e-01 8.36292436e+01
1716.lowfreq: -179.8477 -2.5708 -0.0006 0.0003 0.0004 2.4471 7.4768 36.9194 52.2884
frequency: -179.8444 36.9143 52.2450 78.6744 89.2941 98.2047 104.2884 145.5679 154.0544 209.7896 233.4665 264.5853 274.4748 300.4095 319.8177 350.5421 368.7628 404.2661 438.0643 483.6314 497.9076 508.6692 521.6431 606.2112 615.1600 643.6491 663.6331 719.7900 721.6557 754.2445 773.3647 810.1086 821.2102 831.2476 889.8874 896.5524 938.0456 948.4671 959.4691 968.6820 1036.7419 1055.4546 1083.9016 1085.5834 1090.1397 1140.1539 1146.7027 1174.7847 1207.7275 1215.5645 1224.7611 1233.0134 1255.2133 1272.6789 1277.8812 1306.0365 1329.0449 1339.3284 1355.6983 1364.0644 1391.6303 1425.9446 1459.0351 1472.5435 1476.8625 1480.1293 1489.1137 1509.5310 1525.2401 1562.1877 1581.5084 1626.5260 1637.4697 2926.4880 2949.7490 2966.5528 2993.9584 3007.8646 3043.8043 3045.3104 3046.3804 3121.0016 3156.8909 3521.1822 3565.0709 3573.6902 3608.1342
redmass: 1.3791 4.3337 4.6336 2.6810 5.9059 3.9358 2.0519 3.7061 9.2538 7.7295 3.9356 4.9543 4.6962 2.4470 6.2487 1.4832 2.1121 1.2718 4.6735 4.5286 3.7637 1.2880 5.0546 6.4829 4.8768 7.8105 2.8378 6.1953 7.0165 5.7820 5.8000 4.3103 1.3928 1.1739 2.9196 4.0129 3.9176 1.2947 3.4602 2.5287 3.7138 3.1300 2.4879 1.5888 2.9051 1.7693 1.7766 1.1219 1.0809 1.7170 1.2101 1.2950 2.8035 1.5935 1.5141 1.3846 1.4202 2.5494 1.6370 1.8239 2.6914 1.8818 1.7235 1.2874 1.1845 1.0962 1.5674 1.1842 3.9713 2.5316 4.6588 5.5324 6.2180 1.0705 1.0661 1.0566 1.0595 1.1088 1.1073 1.0971 1.0919 1.0896 1.0954 1.0758 1.0769 1.0771 1.0801
irintensity: 79.6722 6.8514 4.3583 0.2302 5.7761 1.9027 19.3742 1.0201 0.3506 2.1593 0.1499 5.1096 27.5792 23.5306 2.9346 44.0715 29.2923 181.7089 8.7608 5.5074 10.1643 130.5544 5.1371 4.9850 3.1165 5.4944 5.1026 1.4740 4.0642 2.8261 1.0879 39.8303 61.5925 0.5244 6.9235 4.6153 16.2619 3.3717 33.9550 9.1420 23.9464 1.4820 63.7530 0.1234 26.6588 1.1093 11.0692 1.2128 0.0060 19.1571 8.6516 35.2570 5.7996 71.0650 21.1330 11.0231 197.7665 228.9092 28.7574 16.5507 44.4392 114.6641 11.1900 10.6524 19.8132 4.2638 32.6667 1.7432 498.0095 448.8954 113.0094 393.0920 125.7200 137.4029 97.9456 87.0519 145.2420 13.9006 69.4359 44.7938 68.9459 23.3974 40.1005 55.9795 31.7986 21.8227 16.0235
temp: 298.150 k
press: 1.00000 atm
elementType: 35 7 7 7 7 7 6 6 6 6 6 6 6 6 6 6 6 1 1 1 1 1 1 1 1 1 1 1 1 1 1
symmnumber: 1
zpe: 645115.7 jmol-1
zpe.correction: 0.245712 hartree
zpe.thermalcorrener: 0.261361 hartree
zpe.thermalcorrenthalpy: 0.262305 hartree
zpe.thermalcorrgfe: 0.201330 hartree
zpe.sumelectzpe: -713.527419 hartree
zpe.sumelectthermal: -713.511770 hartree
zpe.sumelectthermalent: -713.510825 hartree
zpe.sumelectthermalfe: -713.571800 hartree
dipole: -1.5962 1.5247 0.2036
dipole: 2.2167
quadrupole: -73.3276 -101.1022 -115.5485
quadrupole: 12.3455 -0.4650 -1.2495
quadrupole: 23.3318 -4.4427 -18.8891 12.3455 -0.4650 -1.2495
hfenergy: -713.7731303 hartree
pointgroup: C01 [X(C11H14Br1N5)]
dipole: 0.6003741 -0.6293804 0.0636431 debye
polarizability: 280.1602095|0.7552337|187.5144259|0.5235017|2.2674816|83.6760107 unknown
InChI: InChI=1S/C11H14BrN5/c12-9-7(17-11-15-5-6-16-11)1-2-8-10(9)14-4-3-13-8/h1-2,13-15,17H,3-6H2
charge 0 multiplicity 1
31 atoms
Br 0.565358 -2.950282 -0.028919
N  3.216573 -1.238781 -0.008632
N  3.511765 1.535885 0.03359
N  -1.69604 -0.778996 0.017317
N  -4.073918 -1.001389 0.024163
N  -3.193615 1.134381 0.03573
C  2.065713 -0.439337 0.003078
C  2.208821 0.99121 0.032515
C  4.531401 -0.657562 -0.297999
C  4.650978 0.702676 0.427457
C  -0.421537 -0.161534 0.013774
C  0.752165 -0.967414 -0.000039
C  1.050138 1.7962 0.038352
C  -0.247101 1.2461 0.022813
C  -5.298869 -0.180681 0.029072
C  -2.94217 -0.16427 0.025473
C  -4.684699 1.276264 0.041821
H  4.687472 -0.495748 -1.385887
H  5.315544 -1.346056 0.066337
H  4.688614 0.519576 1.524235
H  5.589616 1.202478 0.126826
H  3.096224 -2.249522 -0.064537
H  3.59295 2.547205 0.130088
H  1.161855 2.887561 0.058731
H  -5.920354 -0.377456 0.924125
H  -5.917841 -0.362688 -0.870999
H  -1.14449 1.869659 0.028621
H  -1.684545 -1.800635 0.010152
H  -5.005954 1.856001 -0.84326
H  -5.000197 1.837521 0.940818
H  -4.069858 -2.018066 0.006584
