program: Gaussian 09
title: 000131826
version: EM64L-G09RevD.01
frameworkgroup: C1[X(C22H26N2O5)]
method: RPBEPBE
basis: SDD
operation: Freq
keyword: #p
keyword: freq=noraman
keyword: PBEPBE/SDD
title: #p freq=noraman PBEPBE/SDD
converged: YES YES NO NO
title: Mulliken charges:
elementType: O O O O O N N C C C C C C C C C C C C C C C C C C C C C C H H H H H H H H H H H H H H H H H H H H H H H H H H
charge: -0.276347 -0.462324 -0.212748 -0.195934 -0.228335 -0.405456 -0.578748 -0.407010 -0.019450 -0.139571 -0.215104 -0.716206 -0.712292 -0.611334 0.202162 0.138892 0.491894 -0.558644 -0.391155 0.314184 -0.234887 -0.360551 -0.058402 0.360692 0.187869 -0.669764 -0.416295 -0.310112 -0.169085 0.232989 0.243629 0.215213 0.281919 0.231567 0.346412 0.216594 0.214702 0.221971 0.207558 0.220586 0.214369 0.234829 0.219772 0.265868 0.307618 0.280365 0.255059 0.236112 0.259186 0.420477 0.251016 0.250411 0.283908 0.274153 0.267775
chargesum: 0.00000
title: Mulliken charges with hydrogens summed into heavy atoms:
elementType: O O O O O N N C C C C C C C C C C C C C C C C C C C C C C
charge: -0.276347 -0.041847 -0.212748 -0.195934 -0.228335 -0.059045 -0.005262 0.069608 0.195763 0.142348 0.016463 -0.062939 -0.069778 -0.156732 0.202162 0.138892 0.491894 -0.278279 -0.136096 0.314184 0.001225 -0.101365 -0.058402 0.360692 0.187869 -0.168336 -0.132386 -0.035959 0.098690
polarizability: 3.31008825e+02 -1.60309075e+01 2.74845690e+02 -2.82953162e+00 -2.04860170e+01 2.06690452e+02
1716.lowfreq: -7.6268 -5.2923 -0.0007 -0.0005 0.0007 2.7625 12.6017 17.8091 22.5738
frequency: 12.0874 17.7825 22.5138 33.6812 36.9605 37.3536 46.0601 55.3684 70.5335 74.3579 80.9239 96.0095 101.6664 119.4883 135.9602 147.2747 163.5320 187.6609 192.2103 201.9166 214.2731 229.0781 243.5182 260.0586 271.0246 282.7115 295.2970 306.8736 324.7357 346.2933 347.5621 370.6943 383.5510 394.2527 413.9857 417.6691 429.6092 488.7109 495.0049 513.2892 530.7824 565.7234 580.0150 586.7926 593.2161 605.3027 621.1982 631.7210 649.7129 666.5262 678.1782 700.0958 712.5976 724.8711 733.6082 737.5668 752.9355 762.7515 775.5726 819.2671 823.8904 827.0065 859.0590 865.6043 869.9384 883.1942 890.8141 897.0913 918.1635 925.7786 937.0330 947.3341 954.6957 960.5407 962.7238 970.7367 984.3724 988.2070 997.5376 1004.6877 1026.1038 1043.0660 1053.7566 1092.9594 1095.3060 1107.3225 1122.7746 1126.5663 1134.0687 1138.8294 1151.1128 1170.9583 1175.6174 1184.5570 1186.2012 1212.1398 1230.6823 1233.9034 1246.3198 1252.4110 1279.8293 1281.2260 1295.5964 1306.1054 1308.4246 1312.9582 1314.6719 1346.4726 1356.4721 1358.8466 1379.0779 1382.4041 1390.3000 1397.0199 1410.6921 1430.8901 1454.1734 1463.9620 1469.9205 1470.8732 1472.1956 1473.4868 1482.7810 1491.6739 1496.3896 1543.7603 1559.2542 1586.1488 1587.2356 1610.0903 1625.2194 1642.2321 1669.2121 2968.5145 2971.8993 2973.2973 2974.5457 2983.0525 2992.3138 2997.2624 3057.9174 3060.2756 3061.4229 3069.5619 3072.9940 3076.1697 3114.2782 3122.4271 3130.9669 3140.1027 3160.2802 3213.7248 3227.3403 3232.2582 3267.7245 3457.7485 3475.9213 3546.1764 3596.7410
redmass: 4.9596 5.4947 5.5466 5.7784 3.0304 5.1870 6.3400 4.6430 5.7515 6.8914 5.4306 5.1737 4.5917 5.4397 4.8019 4.9442 4.1838 4.6724 3.1608 2.0976 1.4136 3.5897 1.2240 3.5930 3.7775 2.9376 4.4984 2.7356 1.4418 2.9753 6.9030 2.7625 2.4888 3.6682 2.0267 3.6122 4.8392 4.7114 3.3230 4.2399 3.8133 3.8231 3.3283 2.8017 2.9148 1.8721 1.6318 2.0300 1.4499 2.6045 4.1635 2.9727 3.3976 1.8463 3.3197 1.5210 2.9459 2.8048 2.9689 2.4826 1.3624 2.1330 3.3981 2.3622 6.4976 1.3264 3.4124 2.6387 1.2687 1.7362 1.8480 1.4323 2.0165 1.6303 1.4366 3.0548 2.0985 5.9778 1.3691 1.6096 2.3462 2.4157 2.3673 1.9082 2.0526 4.1443 1.5992 2.2568 1.6682 1.3283 1.7810 2.0883 1.7298 2.0501 1.1022 1.4566 1.8254 1.2592 1.3508 3.0190 1.5651 1.4914 1.2716 1.3146 1.7284 2.4338 1.5677 1.4513 2.4592 1.4358 1.2231 2.2334 3.4481 1.2133 1.3801 2.9563 1.0820 1.1097 1.0583 2.4049 4.1147 1.0588 1.0721 1.2157 1.6584 5.2002 7.9752 3.2901 3.3431 6.5380 6.2710 1.5865 9.5112 1.0360 1.0850 1.0771 1.0406 1.0776 1.0606 1.0651 1.1019 1.1034 1.0997 1.0992 1.0995 1.0984 1.0603 1.0878 1.0913 1.0909 1.0988 1.0919 1.1162 1.0999 1.1067 1.0451 1.0654 1.0779 1.0980
irintensity: 1.1766 0.6939 0.4607 0.6241 0.4504 1.6803 5.3810 1.3510 2.6888 1.6593 0.6144 3.1036 0.6309 0.6426 2.4682 0.1168 0.2640 2.8641 2.0355 1.1372 1.1014 7.2014 0.3939 2.0655 1.4268 21.2094 5.3855 6.5087 40.9600 0.4354 2.4557 0.1813 0.0647 8.8841 0.5035 0.8192 2.9525 5.9192 19.6565 12.9002 64.4193 5.6673 12.0161 48.7558 36.1070 212.1195 61.4714 29.2974 237.3450 25.6833 0.5790 29.4711 1.5928 7.8109 10.5642 66.3624 10.8460 2.8937 12.8567 7.1333 72.3879 5.5754 17.8386 31.3972 5.3927 2.2370 10.3885 9.6201 16.5747 8.3844 59.2874 1.8363 10.7127 9.7765 49.1733 23.5490 15.3921 1.8504 1.7222 60.9572 34.5595 159.1566 70.5448 11.6693 7.3275 6.9988 5.1567 4.4111 16.9638 7.0599 16.5484 79.0384 8.6014 25.6057 1.4601 5.4466 18.0127 0.5221 1.1985 67.6664 15.5980 17.6072 3.8613 5.6849 19.1604 66.3299 18.6393 15.2156 1.1963 3.1482 20.4975 6.4227 4.3855 14.1924 27.7119 44.5737 9.3548 6.1055 7.0752 6.0770 12.2860 8.2137 1.1672 61.4877 198.7602 58.9062 106.9500 83.4303 155.1783 5.0235 9.3559 20.9465 196.9935 36.8922 31.4715 6.1216 27.4971 9.9833 39.4585 23.8657 2.1992 11.5484 9.2916 54.2605 45.9197 56.2725 1.8207 3.0368 4.8111 9.9002 11.5099 3.4024 1.9263 0.4460 0.1868 15.2343 186.0392 44.3233 9.5990
temp: 298.150 k
press: 1.00000 atm
elementType: 8 8 8 8 8 7 7 6 6 6 6 6 6 6 6 6 6 6 6 6 6 6 6 6 6 6 6 6 6 1 1 1 1 1 1 1 1 1 1 1 1 1 1 1 1 1 1 1 1 1 1 1 1 1 1
symmnumber: 1
zpe: 1156415.3 jmol-1
zpe.correction: 0.440455 hartree
zpe.thermalcorrener: 0.470076 hartree
zpe.thermalcorrenthalpy: 0.471020 hartree
zpe.thermalcorrgfe: 0.376126 hartree
zpe.sumelectzpe: -1337.401083 hartree
zpe.sumelectthermal: -1337.371462 hartree
zpe.sumelectthermalent: -1337.370518 hartree
zpe.sumelectthermalfe: -1337.465412 hartree
dipole: 1.1191 -1.7875 0.1081
dipole: 2.1117
quadrupole: -182.6516 -162.3224 -178.2935
quadrupole: -9.4418 12.8434 5.6185
quadrupole: -8.2291 12.1001 -3.8710 -9.4418 12.8434 5.6185
hfenergy: -1337.8415381 hartree
pointgroup: C01 [X(C22H26N2O5)]
dipole: 0.4837346 -0.6649989 0.1183062 debye
polarizability: 332.3635843|-9.6833836|270.3710853|9.5010966|-24.9275997|209.8102978 unknown
InChI: InChI=1S/C22H26N2O5/c1-13(2)10-18(22(27)28)24-21(26)17(23)12-15-6-4-7-16(11-15)20(25)14(3)19-8-5-9-29-19/h4-9,11,13,17-18,24,27H,3,10,12,23H2,1-2H3
charge 0 multiplicity 1
55 atoms
O  -3.899477 1.601155 0.346406
O  -0.324515 -1.554155 0.257263
O  -1.468628 -2.65065 1.959957
O  3.667075 2.208162 -1.587437
O  4.562444 -1.990656 0.578612
N  -2.24967 0.105742 -0.319314
N  -3.337559 3.076397 -1.965352
C  -3.898685 -1.748597 0.233705
C  -3.870023 -2.391949 -1.175611
C  -2.641974 -0.92003 0.658645
C  -2.241919 2.383179 -1.287506
C  -2.817067 -3.51792 -1.316388
C  -5.282514 -2.931012 -1.510752
C  -1.326811 3.340294 -0.414478
C  -2.878302 1.326261 -0.364151
C  -1.458635 -1.80359 1.044906
C  -0.165676 2.631036 0.256803
C  1.035646 2.375128 -0.444202
C  -0.278589 2.159233 1.594017
C  2.093293 1.637777 0.151403
C  0.774181 1.442811 2.204454
C  1.955144 1.166341 1.483983
C  3.365728 1.446508 -0.620965
C  4.324202 0.34359 -0.194671
C  3.801609 -1.018253 -0.12137
C  5.62752 0.663025 0.062363
C  2.684166 -1.639844 -0.675357
C  2.739824 -3.040458 -0.315796
C  3.888224 -3.213526 0.441965
H  -4.058388 -2.528404 1.004293
H  -4.751746 -1.047149 0.288484
H  -3.629196 -1.593374 -1.9078
H  -2.940369 -0.393359 1.58889
H  -1.590832 1.885771 -2.03504
H  -1.383366 -0.044982 -0.840724
H  -2.976599 -4.304238 -0.553895
H  -2.892283 -3.992775 -2.312253
H  -1.783676 -3.142046 -1.208923
H  -5.58264 -3.721352 -0.795533
H  -6.040415 -2.12726 -1.466412
H  -5.308593 -3.367968 -2.526029
H  -1.984158 3.823124 0.332082
H  -0.954076 4.127563 -1.098177
H  -3.070242 3.912782 -2.489487
H  -4.156721 3.202738 -1.360536
H  1.181763 2.755139 -1.46288
H  -1.199254 2.362008 2.155545
H  0.673844 1.103505 3.241193
H  2.774483 0.616594 1.959069
H  0.466662 -2.071616 0.573985
H  5.971764 1.697745 -0.025309
H  6.353628 -0.099416 0.36176
H  1.933081 -1.152377 -1.293811
H  2.047059 -3.825966 -0.614148
H  4.351756 -4.065286 0.931622
