program: Gaussian 09
title: 000131824
version: EM64L-G09RevD.01
frameworkgroup: C1[X(C20H14O11P2)]
method: RPBEPBE
basis: SDD
operation: Freq
keyword: #p
keyword: freq=noraman
keyword: PBEPBE/SDD
title: #p freq=noraman PBEPBE/SDD
converged: YES YES NO NO
title: Mulliken charges:
elementType: P P O O O O O O O O O O O C C C C C C C C C C C C C C C C C C C C H H H H H H H H H H H H H H
charge: 1.338498 1.340366 -0.223789 -0.263931 -0.205667 -0.536226 -0.536916 -0.639551 -0.638683 -0.640877 -0.641482 -0.583866 -0.582216 -0.079896 0.295004 0.357602 0.353615 0.085065 0.149092 0.149561 0.098254 -0.394543 -0.332210 -0.331899 -0.374592 -0.532843 -0.533471 -0.385345 -0.386601 -0.212335 0.397465 0.399163 -0.221263 0.252339 0.252510 0.258963 0.272407 0.295159 0.295314 0.294085 0.296005 0.236799 0.239172 0.403957 0.407340 0.404933 0.405533
chargesum: 0.00000
title: Mulliken charges with hydrogens summed into heavy atoms:
elementType: P P O O O O O O O O O O O C C C C C C C C C C C C C C C C C C C C
charge: 1.338498 1.340366 -0.223789 -0.263931 -0.205667 -0.536226 -0.536916 -0.235594 -0.231343 -0.235944 -0.235949 -0.583866 -0.582216 -0.079896 0.295004 0.357602 0.353615 0.085065 0.149092 0.149561 0.098254 -0.135580 -0.079871 -0.079388 -0.102185 -0.237684 -0.238157 -0.091260 -0.090596 0.024464 0.397465 0.399163 0.017909
polarizability: 3.94125577e+02 3.15990985e-01 3.33569820e+02 -4.43485212e+00 4.27990884e-02 2.16677755e+02
1716.lowfreq: -7.5430 -2.8074 -0.0018 -0.0013 -0.0011 2.3664 13.5649 19.1928 22.7095
frequency: 13.5231 19.1550 22.5100 28.8661 33.0424 39.8536 42.3945 51.5655 55.4868 67.9769 83.2169 99.7521 105.9436 129.6647 133.3452 164.2872 178.8994 189.0194 205.8679 214.4558 216.5494 235.9058 240.0786 242.1185 264.5999 266.9817 271.9326 304.9742 308.9585 319.3462 331.5281 340.3018 345.5104 348.7442 361.4465 368.5434 380.6887 391.3137 417.0104 456.6555 460.2965 464.6578 485.5550 502.1957 509.2780 545.2669 551.3228 561.4661 577.5633 602.4097 617.6374 636.8783 653.1319 658.3324 658.7769 665.1263 693.1674 706.5473 714.3310 719.9298 725.7714 750.2224 753.0821 757.5943 763.3195 778.4199 786.3384 795.3286 800.7191 835.3068 848.3158 882.5703 884.2703 888.1520 916.2492 921.9652 941.5214 969.6328 970.5744 971.2187 975.1858 997.8432 1003.8206 1010.7475 1014.6405 1027.7963 1035.0601 1035.9771 1059.9137 1061.5091 1081.8642 1099.2105 1114.5750 1140.3688 1147.9391 1172.1298 1176.3264 1201.2594 1218.6387 1225.7663 1254.5285 1254.9880 1269.0452 1278.1334 1285.5614 1384.7653 1392.8816 1400.9226 1416.0332 1437.2790 1449.5554 1461.3359 1482.3668 1486.8715 1570.4264 1595.1351 1605.5910 1615.7921 1616.4791 1636.9271 1688.6350 3135.9724 3146.5873 3146.9137 3147.6564 3158.6966 3167.9173 3168.8050 3172.1971 3191.8914 3192.4018 3595.1394 3595.4140 3596.7351 3597.1944
redmass: 9.2428 8.6804 7.1526 6.9391 5.7325 7.1841 5.2603 3.2791 7.0859 2.4509 2.0827 3.6593 3.5657 9.5895 5.3547 6.4776 5.1143 5.1873 6.2595 5.7713 7.0903 1.4450 2.6989 2.2428 4.6037 5.6155 3.3809 4.4494 3.7107 4.8904 7.7920 7.7210 7.5957 7.8881 9.2936 8.9484 7.9230 5.8757 3.3505 5.9078 3.8591 4.0255 4.2759 8.4672 5.8008 6.5640 8.4318 8.8161 7.1441 8.5287 5.0959 4.9671 8.7502 8.1490 7.3464 5.0225 6.7473 9.0735 7.7557 5.9264 3.6473 6.5346 6.9806 3.0735 7.5364 9.5512 1.6560 2.9758 8.9623 1.3989 1.9306 1.5427 1.5444 1.5202 5.4719 4.1847 6.4582 1.3534 1.5124 1.3736 2.7690 5.5287 1.3372 1.3593 1.3142 2.4468 1.3080 1.3017 5.7266 4.9802 2.9064 1.8727 2.2895 2.0411 1.8515 1.1274 1.5878 2.8431 1.6416 5.1169 3.5928 3.9696 1.4944 1.5684 2.0918 9.4123 10.7193 8.8876 4.2408 4.0973 2.4733 2.6252 2.8581 2.7871 9.0349 9.3189 7.6730 7.3344 7.1043 7.4983 12.9916 1.0864 1.0890 1.0891 1.0902 1.0954 1.0971 1.0970 1.1004 1.0933 1.0934 1.0668 1.0660 1.0669 1.0660
irintensity: 0.4896 0.8328 1.1125 0.1708 6.9095 3.8605 24.1125 32.0612 3.5737 53.7089 74.9499 47.7444 5.1532 0.0635 0.2368 4.0533 10.5500 6.3343 1.2700 19.2909 16.6943 117.1863 17.8128 68.3197 10.3071 12.2604 18.6516 2.6807 67.7288 38.4621 43.4368 55.4926 18.5719 27.1434 1.6759 38.5446 105.8262 3.2594 2.1667 16.5133 34.6192 7.5339 27.6426 17.3867 18.4582 13.8882 4.0279 12.1764 14.7182 3.8019 3.7117 4.9762 2.3692 8.3510 6.4933 18.0508 6.4826 345.4745 91.0837 11.4449 11.6058 41.6454 400.2811 65.1583 139.1226 178.2256 38.9829 77.1330 443.3999 0.2660 32.4881 4.2929 91.9515 8.1355 42.1972 5.7910 7.9270 9.7361 34.2916 7.1561 339.3392 130.8799 0.1179 21.5403 25.9308 57.5260 82.7684 71.3507 182.9387 194.4717 25.1011 1.2182 496.7770 189.0407 9.6679 3.6096 22.2571 71.5008 75.1421 54.8401 54.1429 27.3711 22.4476 0.3952 17.2901 160.9250 0.8256 1.9940 177.4639 37.3630 13.8456 2.8036 304.1105 27.9982 6.1316 77.3253 6.9225 11.9787 378.7492 21.7977 383.3641 0.7956 1.6741 7.1534 6.6414 8.0147 1.2264 1.4058 20.4659 0.3973 1.7986 96.2511 104.0591 70.8475 131.4456
temp: 298.150 k
press: 1.00000 atm
elementType: 15 15 8 8 8 8 8 8 8 8 8 8 8 6 6 6 6 6 6 6 6 6 6 6 6 6 6 6 6 6 6 6 6 1 1 1 1 1 1 1 1 1 1 1 1 1 1
symmnumber: 1
zpe: 811150.7 jmol-1
zpe.correction: 0.308951 hartree
zpe.thermalcorrener: 0.340264 hartree
zpe.thermalcorrenthalpy: 0.341208 hartree
zpe.thermalcorrgfe: 0.242386 hartree
zpe.sumelectzpe: -2278.110138 hartree
zpe.sumelectthermal: -2278.078825 hartree
zpe.sumelectthermalent: -2278.077881 hartree
zpe.sumelectthermalfe: -2278.176703 hartree
dipole: -0.7434 0.0667 -5.5652
dipole: 5.6150
quadrupole: -178.7193 -200.1524 -198.4643
quadrupole: -0.0725 -0.3746 -16.9923
quadrupole: 13.7260 -7.7071 -6.0190 -0.0725 -0.3746 -16.9923
hfenergy: -2278.4190887 hartree
pointgroup: C01 [X(C20H14O11P2)]
dipole: -0.2261287 0.1156216 -2.1944558 debye
polarizability: 394.2331565|-0.0538889|333.3760201|0.9237732|4.7380327|216.7639759 unknown
InChI: InChI=1S/C20H14O11P2/c21-19-13-3-1-2-4-14(13)20(29-19)15-7-5-11(30-32(22,23)24)9-17(15)28-18-10-12(6-8-16(18)20)31-33(25,26)27/h1-10,22-23,25-26H
charge 0 multiplicity 1
47 atoms
P  6.294325 -1.94385 0.034733
P  -6.286913 -1.865597 -0.404056
O  0.130551 1.433765 1.85516
O  -0.006276 -1.981496 0.189045
O  0.228078 3.460966 3.017537
O  4.692465 -2.283862 -0.513418
O  -4.756886 -2.241842 0.295719
O  7.086219 -3.313021 -0.604106
O  6.173096 -2.376797 1.679025
O  -7.185402 -3.195542 0.175699
O  -6.017546 -2.338444 -2.021086
O  6.913257 -0.52049 -0.299366
O  -6.891883 -0.418397 -0.160833
C  0.020915 0.977628 0.366296
C  -0.025733 2.316445 -0.369047
C  1.25678 0.147813 0.077198
C  -1.251356 0.159962 0.255627
C  0.047076 3.384137 0.546718
C  1.197179 -1.267393 0.051377
C  -1.210029 -1.255766 0.22571
C  0.14516 2.853451 1.935042
C  -0.125671 2.563492 -1.750126
C  2.527276 0.751885 -0.092631
C  -2.527018 0.776536 0.26962
C  0.023493 4.729164 0.1265
C  2.347821 -2.062534 -0.119315
C  -2.381053 -2.039124 0.211405
C  3.695359 -0.006651 -0.279904
C  -3.717634 0.029942 0.26656
C  -0.150379 3.910623 -2.18618
C  3.583151 -1.419119 -0.279797
C  -3.620087 -1.383101 0.236847
C  -0.076455 4.984772 -1.259408
H  2.60124 1.844084 -0.075562
H  -2.586818 1.869233 0.30279
H  -0.183496 1.740222 -2.469706
H  0.081561 5.537417 0.862534
H  2.275807 -3.151976 -0.123456
H  -2.321503 -3.128774 0.177676
H  4.666456 0.477937 -0.418864
H  -4.693251 0.523802 0.297277
H  -0.227624 4.129518 -3.256831
H  -0.097533 6.016415 -1.626209
H  7.283579 -3.271691 -1.574384
H  6.856518 -1.967936 2.268864
H  -7.4727 -3.13266 1.122154
H  -6.704116 -2.029145 -2.665427
