program: Gaussian 09
title: 000131816
version: EM64L-G09RevD.01
frameworkgroup: C1[X(C19H24O4)]
method: RPBEPBE
basis: SDD
operation: Freq
keyword: #pfreq=noraman
keyword: PBEPBE/SDD
title: #p freq=noraman PBEPBE/SDD
converged: YES YES NO NO
title: Mulliken charges:
elementType: O O O O C C C C C C C C C C C C C C C C C C C H H H H H H H H H H H H H H H H H H H H H H H H
charge: -0.284943 -0.287344 -0.437819 -0.263153 -0.241281 -0.071627 0.363370 -0.258408 -0.543413 -0.048113 -0.550052 -0.493898 0.280466 -0.316386 -0.770176 -0.578007 0.305658 -0.347013 -0.541902 -0.461724 0.287651 0.321766 -0.761468 0.234699 0.254501 0.216958 0.233817 0.234862 0.253439 0.224371 0.239062 0.213518 0.219009 0.203547 0.206984 0.227905 0.237469 0.218674 0.225543 0.227361 0.245887 0.256260 0.225349 0.244463 0.254694 0.245460 0.353985
chargesum: 0.00000
title: Mulliken charges with hydrogens summed into heavy atoms:
elementType: O O O O C C C C C C C C C C C C C C C C C C C
charge: -0.284943 -0.287344 -0.083833 -0.263153 -0.006581 0.182874 0.363370 -0.041451 -0.074735 0.205326 -0.086618 -0.061372 0.280466 0.094145 -0.086127 -0.125103 0.305658 -0.101126 -0.285642 -0.236375 0.287651 0.321766 -0.016851
polarizability: 2.56952044e+02 -1.25343340e+01 2.00832049e+02 -3.27784392e-01 -1.53431160e+01 1.65294524e+02
1716.lowfreq: -12.8008 -8.1548 -0.0001 0.0000 0.0007 6.1077 23.6262 28.6607 35.0923
frequency: 23.5215 28.0897 35.0167 36.8823 57.6135 77.3523 85.4120 116.3003 141.3659 171.6744 187.2099 193.1722 198.3536 206.9312 226.5451 244.1313 264.3565 309.3213 312.3052 352.5742 354.2089 365.5124 400.3839 402.8925 425.1540 447.9678 452.1551 462.4527 503.0069 544.1528 547.5205 557.5863 573.0933 582.8918 612.8317 637.2966 655.3190 677.4996 710.7020 729.5717 737.2401 788.4454 808.8440 810.5912 826.5434 854.3709 857.7771 875.1688 883.0981 901.2493 905.8727 921.8792 927.0251 938.0919 945.2687 992.3442 995.4036 998.7184 1014.0276 1027.7562 1037.8678 1041.7256 1047.0825 1088.2964 1091.3945 1099.8187 1121.8147 1134.0613 1143.3942 1151.3438 1155.8330 1172.1439 1174.9853 1183.1072 1203.6104 1205.1813 1216.7168 1235.0239 1243.2468 1259.0587 1268.9826 1274.9212 1275.7596 1285.2762 1291.7156 1301.3449 1320.3901 1325.0701 1333.4333 1337.6414 1341.2535 1353.3217 1364.6948 1375.5899 1381.7242 1384.0421 1385.3162 1443.4058 1452.4281 1453.8951 1454.8283 1455.7480 1461.9301 1470.2875 1476.2874 1480.2503 1495.0515 1498.7396 1587.7734 1632.0765 1646.5462 2924.3834 2958.9168 2961.6769 2971.2036 2977.4586 2981.3077 2989.2638 2994.4598 3003.6626 3006.5149 3020.8764 3033.6819 3035.5102 3041.2117 3055.6123 3074.1703 3087.0194 3096.3851 3098.0656 3115.4081 3141.6005 3142.3902 3147.3229 3581.5590
redmass: 1.2213 3.5983 3.1589 4.6656 4.6218 3.2123 2.7550 4.2207 5.0056 2.8049 1.6817 3.7221 2.9124 2.5479 4.1945 2.2014 3.6854 4.4603 4.8184 1.1214 2.4734 3.4342 3.0899 3.5102 3.1357 3.1881 3.4681 3.1423 4.8377 3.2681 3.2675 2.8486 3.7797 5.7894 4.0104 3.7954 3.7032 4.6404 4.8522 3.7228 3.6638 1.7166 2.2017 2.6243 2.4267 2.1099 1.7652 2.6416 1.6943 3.4082 3.4970 2.0456 2.5101 1.7371 2.1152 2.1820 1.8820 2.4024 2.9356 2.0482 1.7803 1.6604 1.9441 1.9463 2.5953 1.9472 1.9641 1.5971 1.4823 1.3056 1.4542 1.6551 1.7177 1.5103 2.1606 2.8518 1.6393 1.5578 1.5911 2.9508 1.5427 1.3610 1.4933 1.4200 1.7271 1.3116 1.4432 1.3903 1.3838 1.5754 1.3960 1.6064 1.4068 1.5564 1.2587 3.2150 1.3884 2.8468 1.0650 1.0607 1.0628 1.1775 1.0615 1.0954 1.0653 1.0762 1.0918 2.6183 7.2139 6.3340 9.1450 1.0792 1.0650 1.0787 1.0683 1.0796 1.0587 1.0366 1.0616 1.0663 1.0369 1.0944 1.1031 1.1028 1.0846 1.1000 1.1032 1.0993 1.0969 1.0996 1.0887 1.1012 1.0918 1.0945 1.0660
irintensity: 1.3240 1.3802 1.9533 0.6681 2.3334 1.4361 0.5866 0.8679 3.4835 1.6401 2.2965 1.9636 3.0020 3.1832 8.8625 1.1981 2.8029 4.4892 0.8919 131.4419 5.4043 2.7098 5.5412 0.7980 0.1021 9.7386 10.5404 1.5025 9.7287 2.7908 1.0392 6.9905 11.1868 6.5521 1.7449 3.3726 6.1664 5.5433 0.6774 1.0098 1.5444 28.3091 6.1457 11.4033 8.9596 3.9005 20.7920 7.6143 16.6056 57.3371 19.4984 38.0132 22.5673 9.0696 9.4673 4.7175 78.7110 41.1493 7.4769 6.3016 10.7777 11.2144 20.9572 16.9658 18.4492 10.7019 104.1787 19.9206 26.7293 37.5204 62.6998 22.4204 70.3895 35.8574 36.1677 210.9562 9.7999 7.2084 0.8999 56.9429 3.7226 1.3137 0.8016 11.5723 6.9457 10.9951 0.4250 1.6861 1.0562 4.5188 1.2418 3.8388 4.7336 6.7276 43.4557 28.8394 28.6182 7.4422 20.8610 6.0531 14.2942 6.0677 13.7225 7.0376 7.9151 7.3016 1.5764 93.4386 30.1441 52.3220 166.1897 17.2519 23.1153 2.2446 51.0782 37.6730 93.1631 24.9873 12.2627 18.8495 2.2365 37.3700 22.5054 59.3817 18.3774 25.0652 42.6418 31.1830 6.2299 22.5321 16.8476 10.6386 11.4044 5.0922 39.1539
temp: 298.150 k
press: 1.00000 atm
elementType: 8 8 8 8 6 6 6 6 6 6 6 6 6 6 6 6 6 6 6 6 6 6 6 1 1 1 1 1 1 1 1 1 1 1 1 1 1 1 1 1 1 1 1 1 1 1 1
symmnumber: 1
zpe: 1028639.7 jmol-1
zpe.correction: 0.391788 hartree
zpe.thermalcorrener: 0.413439 hartree
zpe.thermalcorrenthalpy: 0.414383 hartree
zpe.thermalcorrgfe: 0.339907 hartree
zpe.sumelectzpe: -1037.602682 hartree
zpe.sumelectthermal: -1037.581031 hartree
zpe.sumelectthermalent: -1037.580087 hartree
zpe.sumelectthermalfe: -1037.654563 hartree
dipole: -0.6401 -1.5539 0.7718
dipole: 1.8493
quadrupole: -144.0388 -135.6773 -131.8052
quadrupole: -12.4495 4.1972 5.5554
quadrupole: -6.8650 1.4965 5.3685 -12.4495 4.1972 5.5554
hfenergy: -1037.9944698 hartree
pointgroup: C01 [X(C19H24O4)]
dipole: 0.3789458 -0.531878 -0.3207454 debye
polarizability: 248.2723047|24.0813598|208.7929162|-4.9684026|15.200991|166.0133967 unknown
InChI: InChI=1S/C19H24O4/c1-11(20)23-17-10-19(2)16(7-8-22-19)15-5-3-12-9-13(21)4-6-14(12)18(15)17/h4,6,9,15-18,21H,3,5,7-8,10H2,1-2H3
charge 0 multiplicity 1
47 atoms
O  -4.239496 -1.068438 0.479114
O  -0.747938 1.725059 -0.428953
O  5.663255 0.526691 0.016158
O  -0.189646 3.539619 0.938203
C  -2.083012 -1.653777 -0.430353
C  -0.598252 -1.269247 -0.640227
C  -3.009058 -0.443021 -0.107116
C  -0.027515 -0.426548 0.532295
C  -2.380599 0.480028 0.975598
C  -0.895288 0.830517 0.769766
C  -2.395215 -2.650417 0.72003
C  0.303267 -2.498089 -0.884875
C  1.473432 -0.136525 0.363056
C  -3.906034 -2.430825 0.974395
C  -3.471125 0.335624 -1.345367
C  1.697641 -2.047572 -1.359819
C  2.286871 -0.932556 -0.498784
C  2.099004 0.894152 1.109868
C  3.675763 -0.681961 -0.586006
C  3.482427 1.148118 1.021725
C  4.273758 0.349168 0.16439
C  -0.380632 3.057084 -0.20163
C  -0.23971 3.790804 -1.517212
H  -2.451768 -2.106973 -1.374092
H  -0.551548 -0.633233 -1.549994
H  -0.14303 -1.027283 1.463223
H  -2.461751 -0.033029 1.953881
H  -2.973538 1.408593 1.061408
H  -0.54484 1.408642 1.643233
H  -1.803052 -2.414765 1.623119
H  -2.173576 -3.693918 0.438824
H  -0.155368 -3.163054 -1.642921
H  0.392869 -3.085548 0.051238
H  -4.525265 -3.154161 0.409152
H  -4.176018 -2.494322 2.045155
H  -4.238267 1.076852 -1.059195
H  -2.625129 0.873389 -1.805969
H  -3.919382 -0.351286 -2.084611
H  1.619624 -1.683893 -2.40586
H  2.396938 -2.905035 -1.38412
H  1.504585 1.528973 1.775135
H  4.310577 -1.290175 -1.239674
H  3.932088 1.957191 1.611673
H  -1.117258 3.606843 -2.159245
H  0.649646 3.415727 -2.054556
H  -0.123566 4.868274 -1.331547
H  5.982934 1.268004 0.587885
