program: Gaussian 09
title: 000131815
version: EM64L-G09RevD.01
frameworkgroup: C1[X(C13H20N2O5)]
method: RPBEPBE
basis: SDD
operation: Freq
keyword: #p
keyword: freq=noraman
keyword: PBEPBE/SDD
title: #p freq=noraman PBEPBE/SDD
converged: YES YES NO NO
title: Mulliken charges:
elementType: O O O O O N N C C C C C C C C C C C C C H H H H H H H H H H H H H H H H H H H H
charge: -0.280274 -0.227473 -0.271809 -0.401703 -0.268050 -0.190324 -0.560436 0.213540 -0.242168 -0.516127 -0.450700 -0.422274 0.203977 0.168740 -0.248203 -0.210498 -0.493605 -0.385868 0.212713 -0.679513 0.268961 0.279149 0.236913 0.235066 0.228334 0.219644 0.299936 0.261986 0.230303 0.214012 0.279445 0.282218 0.291538 0.265792 0.209433 0.218840 0.215814 0.224763 0.211273 0.376635
chargesum: 0.00000
title: Mulliken charges with hydrogens summed into heavy atoms:
elementType: O O O O O N N C C C C C C C C C C C C C
charge: -0.280274 -0.227473 -0.271809 -0.025068 -0.268050 -0.190324 -0.003105 0.213540 0.026793 -0.000065 0.012700 0.097306 0.203977 0.168740 0.013783 0.233817 0.068058 0.042405 0.212713 -0.027664
polarizability: 1.82666713e+02 1.95571264e+00 1.68852428e+02 2.76477034e+00 -6.32540844e+00 1.48037929e+02
1716.lowfreq: -13.2557 -3.3320 -2.2644 -0.0007 -0.0006 -0.0004 9.0493 19.4374 25.1614
frequency: -9.9180 19.1643 25.0177 50.0261 54.4497 57.8462 68.2273 86.3286 115.0019 123.4360 135.3651 147.9379 159.7931 181.7347 204.6276 219.8478 224.3748 245.8421 257.4609 308.0473 313.5125 343.0321 347.5486 389.3621 404.6936 437.3337 449.4692 504.9683 517.5869 563.0422 589.1011 646.8976 652.1610 689.8324 693.4864 719.6954 745.6142 758.1643 761.5799 790.4367 819.1789 836.3973 872.3492 877.3820 879.6412 901.0705 911.7017 941.6495 954.3146 961.7718 981.0615 1009.5774 1032.7033 1051.3848 1054.6683 1068.0026 1074.7762 1099.1216 1107.8904 1112.4496 1135.6084 1143.6071 1151.1325 1159.9720 1193.4816 1198.3771 1227.0743 1231.5116 1241.3402 1258.6473 1273.7185 1278.2010 1290.0675 1298.7032 1310.9872 1337.1610 1348.6391 1364.4658 1370.1509 1381.1933 1395.4987 1397.0130 1436.5607 1441.3454 1472.1269 1474.6843 1479.0222 1479.8242 1490.8622 1502.7643 1574.2452 1636.2784 1651.3504 1652.6344 2980.7856 2986.0872 2996.6067 3003.4506 3005.3898 3014.2363 3043.1046 3056.4166 3059.9011 3066.1595 3077.9655 3079.4042 3084.0097 3085.7453 3103.6276 3156.9599 3218.2932 3407.8083 3512.5893 3532.4381
redmass: 4.1129 3.9055 4.9875 2.6033 4.6017 3.7023 3.5502 3.5886 4.2080 4.2297 3.5701 3.7095 4.1952 3.9136 4.0284 1.1758 3.9106 2.9684 1.7314 4.3149 2.2261 4.0209 2.9558 3.5912 5.3360 4.4838 4.0404 2.3937 3.8354 3.6824 4.0619 1.5030 4.1477 3.5197 4.7251 3.3952 3.8531 1.0873 2.2349 3.4239 2.9139 1.4158 3.9111 2.6560 1.3117 2.4370 2.5284 1.6034 2.6022 2.1359 2.9630 2.5022 1.7486 2.4628 1.6804 1.9295 2.2790 1.9058 1.7836 2.4872 2.2028 1.4736 5.2025 1.3454 1.4951 1.2170 1.2644 1.2891 1.5854 1.5595 2.0850 1.1016 1.8050 1.4870 1.5948 1.6390 1.6102 1.8057 1.8976 2.0678 1.4879 1.8463 1.1068 1.2337 1.0721 1.0870 1.0589 1.0418 1.0871 1.0933 7.7487 11.7939 2.1525 1.7293 1.0359 1.0641 1.0598 1.0581 1.0619 1.0610 1.1012 1.0877 1.0999 1.1044 1.0970 1.1036 1.0994 1.1042 1.0573 1.0925 1.1152 1.0457 1.0639 1.0946
irintensity: 0.2557 0.4664 0.9572 1.1813 2.7630 0.9382 0.4934 0.1230 2.4499 0.2262 1.5076 1.9571 4.4525 0.9139 2.5492 0.1345 1.7429 6.6085 31.6424 10.9934 58.0779 9.5875 2.9904 9.3707 8.9377 5.8778 14.2901 26.0610 8.3782 27.1807 24.6241 127.6198 6.0818 28.8747 1.9067 39.8714 38.6096 14.3669 198.8266 19.9192 8.6045 1.0815 8.3555 22.8318 8.0143 10.6786 21.8806 3.8171 15.0127 53.2660 6.5675 21.2316 144.9454 9.4893 24.3903 190.9098 20.6546 45.4660 162.6096 10.3736 0.8405 0.5396 177.4185 8.2532 16.2774 8.2753 0.8458 6.6043 20.6959 16.1347 30.1175 0.1211 22.8449 15.4219 31.9902 30.6451 54.8072 26.6696 64.9512 26.7580 21.1699 25.7150 60.9742 15.0350 2.2835 6.5280 2.0478 12.6682 18.3246 5.5437 165.8907 163.9000 152.7252 130.0434 33.5408 30.4335 3.1964 42.5478 10.0524 50.5387 0.2025 7.2125 13.9465 0.0842 5.8748 12.0522 44.4990 83.6125 8.7046 8.4149 4.7134 2.0476 23.2328 4.2402
temp: 298.150 k
press: 1.00000 atm
elementType: 8 8 8 8 8 7 7 6 6 6 6 6 6 6 6 6 6 6 6 6 1 1 1 1 1 1 1 1 1 1 1 1 1 1 1 1 1 1 1 1
symmnumber: 1
zpe: 851133.2 jmol-1
zpe.correction: 0.324180 hartree
zpe.thermalcorrener: 0.344999 hartree
zpe.thermalcorrenthalpy: 0.345943 hartree
zpe.thermalcorrgfe: 0.272491 hartree
zpe.sumelectzpe: -991.437901 hartree
zpe.sumelectthermal: -991.417081 hartree
zpe.sumelectthermalent: -991.416137 hartree
zpe.sumelectthermalfe: -991.489589 hartree
dipole: -1.5485 3.3739 -1.5467
dipole: 4.0216
quadrupole: -108.4549 -110.5920 -115.9994
quadrupole: 4.8761 0.8130 4.2723
quadrupole: 3.2272 1.0901 -4.3173 4.8761 0.8130 4.2723
hfenergy: -991.76208 hartree
pointgroup: C01 [X(C13H20N2O5)]
dipole: -0.6996967 -1.3508688 0.4348031 debye
polarizability: 182.6651668|-2.1382786|170.1590426|-1.6351591|-3.922419|146.7328604 unknown
InChI: InChI=1S/C13H20N2O5/c1-2-5-20-12(19)13-7-8(13)3-4-15(13)11(18)9(14)6-10(16)17/h8-9,16H,2-7,14H2,1H3
charge 0 multiplicity 1
40 atoms
O  -2.66239 0.064016 -0.304438
O  -0.862347 1.16923 0.689863
O  0.783573 0.753703 -1.866783
O  3.090653 2.531264 1.860423
O  3.184584 0.218077 1.874806
N  0.883088 -0.956444 -0.297862
N  3.569209 0.323086 -2.438049
C  -0.567456 -1.072848 -0.250031
C  -0.884399 -2.401262 0.472413
C  -1.15685 -2.265208 -1.028569
C  0.439442 -2.975908 0.988113
C  1.57596 -2.10958 0.362446
C  -1.324196 0.177407 0.082795
C  1.471951 -0.009128 -1.112059
C  3.015841 0.16556 -1.075222
C  -3.527779 1.236608 0.017448
C  3.344242 1.44904 -0.270385
C  -4.915284 0.942651 -0.553901
C  3.187043 1.291923 1.225905
C  -5.892351 2.107806 -0.278987
H  -1.753819 -2.438544 1.133881
H  -2.199191 -2.183644 -1.343284
H  -0.483444 -2.750882 -1.741757
H  0.461587 -2.89214 2.088475
H  0.560062 -4.043581 0.731223
H  2.14214 -2.685172 -0.394672
H  2.280716 -1.739669 1.125416
H  3.513023 -0.689714 -0.588159
H  -3.071598 2.137571 -0.432382
H  -3.547221 1.37217 1.115452
H  2.725376 2.294436 -0.619251
H  4.399728 1.709317 -0.48113
H  3.000886 0.993896 -2.976291
H  3.633193 -0.569245 -2.943843
H  -5.303428 0.007508 -0.107692
H  -4.826469 0.768703 -1.642438
H  -5.534907 3.04825 -0.738098
H  -6.890811 1.887955 -0.696309
H  -6.012379 2.286053 0.806064
H  2.998022 2.392637 2.842269
