program: Gaussian 09
title: 000131813
version: EM64L-G09RevD.01
frameworkgroup: C1[X(C7H6N2O2)]
method: RPBEPBE
basis: SDD
operation: Freq
keyword: #pfreq=noraman
keyword: PBEPBE/SDD
title: #p freq=noraman PBEPBE/SDD
converged: YES YES NO NO
title: Mulliken charges:
elementType: O O N N C C C C C C C H H H H H H
charge: -0.215497 -0.244692 -0.399789 -0.346890 0.122290 0.115156 -0.253742 0.163622 0.015465 0.033920 -0.744633 0.274008 0.365599 0.352739 0.262189 0.249239 0.251016
chargesum: 0.00000
title: Mulliken charges with hydrogens summed into heavy atoms:
elementType: O O N N C C C C C C C
charge: -0.215497 -0.244692 -0.034189 0.005849 0.122290 0.115156 0.020266 0.163622 0.015465 0.033920 0.017810
polarizability: 1.78734466e+02 -1.03872320e+01 8.84946963e+01 -2.00737347e-01 1.91878617e-02 4.30213976e+01
1716.lowfreq: -7.9355 -4.9641 -4.1045 -0.0002 0.0007 0.0009 17.9656 64.6604 66.6228
frequency: 17.8423 64.6588 66.6213 154.0458 168.7965 273.8960 301.3599 333.3579 376.9384 397.3618 423.8221 474.0268 516.2022 610.6867 635.1960 639.3605 699.3445 743.0711 743.2381 785.7481 899.1083 939.8880 960.9162 1028.1035 1030.0413 1130.9488 1174.9307 1290.6818 1324.9075 1363.8942 1378.0073 1400.6270 1442.4145 1457.7325 1458.4152 1615.5494 1641.1354 1683.1362 2278.7414 2975.8564 3061.7326 3069.9295 3182.9616 3526.4665 3566.4120
redmass: 1.0246 5.7042 4.5442 5.6141 7.2104 4.3026 4.9729 8.3855 9.5517 3.2966 9.1542 7.6316 7.9112 6.4279 1.2661 5.8985 2.1688 3.3289 8.5079 2.5512 1.4093 3.2240 6.3657 1.3845 1.3999 4.3316 2.3709 5.3967 1.6543 2.2519 2.4931 1.2748 2.2354 1.0413 1.0411 5.9769 7.5228 5.5384 11.7907 1.0351 1.0983 1.0983 1.0948 1.0770 1.0787
irintensity: 0.1132 0.0407 2.4998 1.0262 11.3269 4.1754 2.0085 13.8151 15.0092 7.1823 1.4869 2.8977 6.4857 1.4296 83.2024 22.4674 0.5310 52.1091 3.7986 134.6579 20.7329 16.5621 4.8932 6.2496 4.6254 8.0432 75.5322 130.5794 1.8207 26.5602 79.5413 2.2811 29.7771 14.4375 14.1551 14.0908 302.1975 818.7462 29.1172 32.4936 12.4289 9.6678 5.0396 59.2626 102.9730
temp: 298.150 k
press: 1.00000 atm
elementType: 8 8 7 7 6 6 6 6 6 6 6 1 1 1 1 1 1
symmnumber: 1
zpe: 318853.3 jmol-1
zpe.correction: 0.121445 hartree
zpe.thermalcorrener: 0.131820 hartree
zpe.thermalcorrenthalpy: 0.132764 hartree
zpe.thermalcorrgfe: 0.083668 hartree
zpe.sumelectzpe: -529.496558 hartree
zpe.sumelectthermal: -529.486183 hartree
zpe.sumelectthermalent: -529.485239 hartree
zpe.sumelectthermalfe: -529.534335 hartree
dipole: -2.2997 -4.2922 0.0035
dipole: 4.8695
quadrupole: -63.2554 -58.8930 -63.9381
quadrupole: 1.6612 -0.0231 0.0037
quadrupole: -1.2266 3.1359 -1.9093 1.6612 -0.0231 0.0037
hfenergy: -529.618003 hartree
pointgroup: C01 [X(C7H6N2O2)]
dipole: 0.9102651 -1.6857198 -0.0064945 debye
dipolederiv: -0.5490461 -0.2053056 -0.0016343 -0.2259696 -1.0823386 -0.003281 -0.0010662 -0.0027045 -0.3476561 -1.6750377 -0.0437244 -0.0003346 0.085748 -0.4846327 -0.000639 -0.0011293 -0.0003564 -0.3870684 -1.0655203 -0.3965915 -0.0031444 -0.2900099 -0.5486282 -0.0008501 -0.0016887 -0.0013448 -0.3509632 -1.5454824 -0.284346 0.0003289 0.7292094 -0.5079679 -0.0015171 0.0008986 0.0004187 -0.3062834 0.3850667 0.0908083 0.0012628 -0.1835838 -0.5825363 -0.0005755 0.0002244 -0.0016693 -0.0269243 1.070797 0.1934265 0.0019686 0.1517008 1.428238 0.004738 0.0010504 0.0045609 0.2647064 0.9994813 0.5458193 0.0006906 0.0415987 0.3098284 0.001624 0.0011179 0.0000168 -0.0370983 2.2155731 0.1013018 0.0012983 -0.5258499 1.0715515 0.0039698 0.0005526 0.0021388 0.3293589 -0.4260281 -0.085091 0.0001015 0.0172809 -0.1605918 -0.0033863 0.0019009 -0.0012586 -0.0591734 0.3296649 0.0669081 0.0007119 0.0587391 -0.1021363 0.0026931 -0.0274215 0.0007852 -0.1495291 -0.0298207 -0.0191007 -0.0048941 0.0253514 0.0921915 -0.0054981 0.0461906 -0.0001997 0.0978032 0.0633072 0.0362084 0.0002516 0.0739912 -0.0005727 -0.0004874 0.0001148 -0.0008163 0.1778303 0.1508803 -0.0354626 -0.0004904 -0.0458665 0.2083774 -0.0004321 -0.0002858 -0.0004245 0.3435988 0.1753066 0.0280326 -0.0002304 0.103806 0.2590274 -0.0003805 0.0001449 -0.0000053 0.3543163 -0.0001592 -0.0400445 -0.0099072 -0.0878422 -0.0490076 -0.0429268 -0.0286241 -0.0431367 0.1242232 -0.0418933 0.0357002 -0.0432274 0.0574377 0.0368627 0.1001104 -0.0957375 0.0965716 0.0248549 -0.0570893 0.0114612 0.0572487 0.0142587 0.1123353 -0.0531613 0.103758 -0.0525759 -0.0519959 unknown
polarizability: 178.6660087|10.6811837|88.562904|-0.1221379|0.1301944|43.0216476 unknown
InChI: InChI=1S/C7H6N2O2/c1-2-3-5-4-8-7(11)9-6(5)10/h4,8-9H,1H3
charge 0 multiplicity 1
17 atoms
O  0.302014 2.171305 0.009237
O  -3.746637 -0.183022 -0.002543
N  -1.684855 0.95467 0.002901
N  -1.733681 -1.386422 -0.003745
C  0.429258 -0.276457 0.001531
C  -0.257072 1.043638 0.0049
C  -0.345928 -1.425047 -0.002573
C  -2.487883 -0.193721 -0.00121
C  1.854329 -0.31793 0.003018
C  3.090062 -0.294719 0.002928
C  4.557104 -0.250248 -0.001191
H  0.11244 -2.4168 -0.005063
H  -2.186626 1.848597 0.005014
H  -2.283994 -2.246863 -0.00675
H  4.913894 0.768754 0.235071
H  4.983562 -0.941762 0.748745
H  4.965914 -0.530171 -0.989868
