program: Gaussian 09
title: 000131811
version: EM64L-G09RevD.01
frameworkgroup: C1[X(C19H20BrNO3S)]
method: RPBEPBE
basis: SDD
operation: Freq
keyword: #p
keyword: freq=noraman
keyword: PBEPBE/SDD
title: #p freq=noraman PBEPBE/SDD
converged: NO YES NO NO
title: Mulliken charges:
elementType: Br S O O O N C C C C C C C C C C C C C C C C C C C H H H H H H H H H H H H H H H H H H H H
charge: 0.001674 0.304194 -0.315912 -0.224482 -0.453986 0.003286 -0.187412 0.003704 -0.457719 -0.463485 -0.487406 -0.448813 -0.443976 0.213372 -0.059729 0.414401 -0.165935 -0.375094 -0.332491 -0.287512 -0.145017 -0.176844 -0.188370 -0.515671 -0.219647 0.237961 0.253898 0.215136 0.225961 0.218489 0.218321 0.254044 0.247258 0.238029 0.230382 0.232077 0.230873 0.371361 0.289382 0.254865 0.283106 0.245470 0.249282 0.249526 0.263448
chargesum: 0.00000
title: Mulliken charges with hydrogens summed into heavy atoms:
elementType: Br S O O O N C C C C C C C C C C C C C C C C C C C
charge: 0.001674 0.304194 -0.315912 -0.224482 -0.082625 0.003286 0.050549 0.257602 -0.016622 -0.026675 0.013896 0.019598 0.018974 0.213372 -0.059729 0.414401 -0.165935 -0.085712 -0.077626 -0.004406 0.100454 0.072438 0.061156 -0.252224 -0.219647
chargesum: 0.00004
polarizability: 2.82891173e+02 -2.04131148e+01 2.47737667e+02 -2.75768647e+00 -1.38699899e+01 2.08017704e+02
1716.lowfreq: -5.3994 -0.4216 -0.1069 0.0015 0.0172 6.7556 13.2191 24.0806 29.7100
frequency: 12.7593 23.9466 29.5887 30.7901 35.3821 44.8041 61.9567 81.7681 96.8981 123.0694 142.4288 167.8710 180.7732 208.6422 221.6572 255.4505 266.6541 270.9643 298.9571 322.7353 335.7777 348.4496 358.0160 395.2389 405.6925 409.1786 422.7048 458.0724 481.1732 513.4673 535.0212 551.4809 578.3753 579.1661 600.4176 610.8729 622.1724 634.4736 673.5430 698.7607 704.4907 708.2388 731.6094 752.3348 787.8983 800.2584 810.6997 819.7219 822.1184 832.2353 839.0869 848.1267 866.0572 872.9881 882.6925 915.3605 923.0464 937.0761 955.7672 958.0278 983.1933 988.2998 995.5369 998.8305 1018.5249 1023.4525 1045.8024 1055.5955 1060.7754 1074.6216 1081.1345 1099.5080 1113.7164 1128.7480 1135.9627 1138.7430 1168.3288 1173.3845 1190.1258 1201.1749 1216.2610 1228.7716 1230.8823 1270.9122 1291.9949 1295.7564 1300.6152 1306.1868 1308.3408 1312.5454 1315.5108 1321.8977 1329.1560 1333.3891 1348.7696 1361.5451 1369.6870 1384.0890 1442.5976 1458.2541 1467.3086 1468.0680 1469.9165 1473.1759 1483.5674 1540.6620 1582.0211 1591.9263 1630.5266 2986.0097 2996.2568 3005.6502 3008.6790 3011.8614 3026.5062 3042.6754 3047.0484 3051.9407 3070.5374 3078.4007 3081.2515 3156.6738 3162.3822 3168.7569 3175.8882 3185.2049 3187.6504 3234.1982 3537.0301
redmass: 7.1580 4.0208 7.1468 4.1987 3.8162 4.5572 5.5968 5.1108 5.1993 5.8555 6.2011 8.0374 6.6016 3.0455 7.0881 7.9202 2.1615 5.5067 2.2563 3.4112 2.4495 3.4019 8.0709 2.3411 2.9153 2.2696 3.3934 4.8223 4.3989 3.8732 4.0787 5.4514 5.5921 4.0098 5.1339 9.1687 7.1818 8.3953 5.4025 4.6785 1.5203 3.3002 4.3461 4.2041 1.4472 2.9913 2.0453 2.9905 2.0866 1.5476 1.5657 1.4238 3.5318 2.9811 3.1408 1.9710 1.9307 2.2053 2.7277 1.5904 1.3606 2.4163 4.8191 2.8652 6.5880 2.8331 1.8652 2.7768 2.5255 2.4117 1.2624 1.6387 1.4218 1.4324 2.9687 3.2164 1.2579 2.9989 1.2230 1.3266 1.3871 1.3815 1.2952 1.4534 1.2662 1.2749 1.3296 1.2841 1.4331 1.3672 1.3843 1.5164 1.3028 2.2839 1.3751 1.4871 5.5100 3.4592 1.0803 1.0788 2.3122 1.0853 1.0834 7.5309 1.0881 5.6400 7.8526 6.1466 12.0166 1.0600 1.0595 1.0604 1.0616 1.0627 1.0862 1.1033 1.0886 1.1030 1.1059 1.1057 1.1048 1.0881 1.0898 1.0900 1.0966 1.0972 1.0953 1.1003 1.0649
irintensity: 0.2560 0.1931 0.2060 0.0844 0.1204 1.4296 0.6010 0.3023 0.5118 0.0791 1.2104 1.5304 0.7757 5.1400 1.0006 5.5610 16.8909 8.7285 20.1631 45.0315 60.6449 16.1661 18.8719 8.4950 0.2597 5.9537 39.9265 4.2352 16.9244 11.7324 2.0881 3.0874 3.4596 4.0274 1.7212 20.2394 0.9436 0.7448 22.5302 14.4538 87.4908 17.1893 16.8612 11.7053 19.9440 49.9046 11.9607 7.2974 11.4278 3.9642 17.7367 46.4300 6.1433 1.9176 26.0872 44.8092 29.9149 24.3315 52.8435 27.4813 1.6697 34.3079 63.9251 26.8223 28.3987 9.3607 60.8331 41.0511 25.7731 26.1911 4.1212 0.0543 25.4389 50.6861 161.4343 181.4329 4.4072 43.2447 4.6552 11.8263 3.8420 32.1927 1.4966 4.8152 0.3286 4.2476 2.5983 1.7118 2.7304 4.3192 2.6957 43.5583 1.3732 1.2119 0.8109 2.5243 9.5696 18.8225 15.3451 1.9600 89.4905 8.5858 21.0678 6.4260 11.7032 0.1404 3.3613 23.7579 106.1983 30.9467 21.1373 88.7643 68.7654 18.8514 7.7218 8.1782 31.8409 3.3339 13.0706 85.7167 37.8474 1.8518 2.7018 5.7126 3.7688 2.4470 2.2614 0.8713 48.9365
temp: 298.150 k
press: 1.00000 atm
elementType: 35 16 8 8 8 7 6 6 6 6 6 6 6 6 6 6 6 6 6 6 6 6 6 6 6 1 1 1 1 1 1 1 1 1 1 1 1 1 1 1 1 1 1 1 1
symmnumber: 1
zpe: 920415.1 jmol-1
zpe.correction: 0.350568 hartree
zpe.thermalcorrener: 0.373630 hartree
zpe.thermalcorrenthalpy: 0.374574 hartree
zpe.thermalcorrgfe: 0.293675 hartree
zpe.sumelectzpe: -1426.094579 hartree
zpe.sumelectthermal: -1426.071517 hartree
zpe.sumelectthermalent: -1426.070573 hartree
zpe.sumelectthermalfe: -1426.151472 hartree
dipole: -5.5172 2.0826 -0.1969
dipole: 5.9004
quadrupole: -153.2477 -161.7419 -159.6457
quadrupole: 2.9632 -2.1815 -8.3245
quadrupole: 4.9641 -3.5301 -1.4340 2.9632 -2.1815 -8.3245
hfenergy: -1426.4451468 hartree
pointgroup: C01 [X(C19H20Br1N1O3S1)]
dipole: 1.2485155 -1.851048 0.6354201 debye
polarizability: 249.5088981|-17.5644982|277.362601|19.5406373|-15.6846649|211.7750441 unknown
InChI: InChI=1S/C19H20BrNO3S/c20-15-5-3-14(4-6-15)19(23,17-2-1-11-25-17)18(22)24-16-12-21-9-7-13(16)8-10-21/h1-6,11,13,16,23H,7-10,12H2
charge 0 multiplicity 1
45 atoms
Br -3.604549 5.35051 -2.260575
S  -3.387111 -1.326011 1.496127
O  1.123061 -0.573426 0.383072
O  0.184009 -0.419171 -1.745077
O  -0.908022 0.370919 1.676189
N  4.521404 0.416432 -0.183086
C  3.2904 -1.59978 0.911967
C  2.436956 -1.000942 -0.222851
C  3.601246 -0.51886 1.98446
C  4.625008 -2.075342 0.266003
C  3.201415 0.222014 -0.839802
C  4.319612 0.686807 1.274563
C  5.347239 -0.818506 -0.351281
C  0.088407 -0.309627 -0.504558
C  -1.210052 0.074321 0.274127
C  -1.816593 1.355558 -0.337096
C  -2.153702 -1.123648 0.188073
C  -1.702919 2.587619 0.347235
C  -2.4629 1.314451 -1.594976
C  -2.289214 -2.104131 -0.784377
C  -3.361232 -3.035107 -0.521826
C  -2.232228 3.772181 -0.213319
C  -2.990364 2.490645 -2.170232
C  -4.04697 -2.76317 0.65009
C  -2.867352 3.707562 -1.4688
H  2.75833 -2.453977 1.366397
H  2.194602 -1.757856 -0.991144
H  4.246105 -0.963599 2.764996
H  2.668513 -0.190784 2.475959
H  4.42563 -2.840706 -0.508502
H  5.248939 -2.554057 1.043116
H  3.354834 0.073153 -1.922107
H  2.602653 1.141355 -0.709349
H  3.724027 1.612562 1.364514
H  5.309914 0.883905 1.722222
H  6.322015 -0.640932 0.136327
H  5.536528 -0.958523 -1.430781
H  -0.183545 -0.243712 1.964908
H  -1.215438 2.609229 1.3246
H  -2.560623 0.36681 -2.132262
H  -1.645064 -2.155971 -1.665736
H  -3.605954 -3.873271 -1.178696
H  -2.149945 4.722637 0.321427
H  -3.487766 2.456192 -3.143451
H  -4.882706 -3.299657 1.096514
