program: Gaussian 09
title: 000131808
version: EM64L-G09RevD.01
frameworkgroup: C1[X(C22H28N4O5)]
method: RPBEPBE
basis: SDD
operation: Freq
keyword: #p
keyword: freq=noraman
keyword: PBEPBE/SDD
title: #p freq=noraman PBEPBE/SDD
converged: YES YES NO NO
title: Mulliken charges:
elementType: O O O O O N N N N C C C C C C C C C C C C C C C C C C C C C C H H H H H H H H H H H H H H H H H H H H H H H H H H H H
charge: -0.480273 -0.479060 -0.395146 -0.394672 -0.458022 -0.401875 -0.404372 -0.090121 -0.303993 0.171947 0.174175 0.238450 0.240511 0.102950 0.104162 -0.009832 -0.010649 -0.368329 -0.366999 -0.363224 -0.372969 -0.398921 0.079890 0.079724 -0.406655 -0.332127 -0.331934 -0.346710 -0.615485 -0.615555 -0.321631 0.252621 0.251300 0.403442 0.402586 0.233984 0.217541 0.203423 0.237476 0.195419 0.228872 0.229069 0.200691 0.259036 0.259179 0.243794 0.228567 0.209699 0.194596 0.227507 0.220375 0.223530 0.193005 0.229367 0.397753 0.398296 0.209970 0.177383 0.348263
chargesum: 0.00000
title: Mulliken charges with hydrogens summed into heavy atoms:
elementType: O O O O O N N N N C C C C C C C C C C C C C C C C C C C C C C
charge: -0.480273 -0.479060 0.002606 0.003625 -0.109759 0.001566 -0.001786 -0.090121 -0.060199 0.171947 0.174175 0.238450 0.240511 0.102950 0.104162 -0.009832 -0.010649 -0.115709 -0.115698 0.088302 0.067931 0.025370 0.079890 0.079724 0.023104 -0.073091 -0.072755 0.091556 0.026993 0.030347 0.065722
polarizability: 4.35979705e+02 -2.01368382e+01 5.25802770e+02 -1.50143079e+00 9.60904245e+00 1.53264829e+02
1716.lowfreq: -6.0528 -4.3345 -3.6311 -0.0012 0.0005 0.0014 8.2637 16.7646 22.0156
frequency: 6.7286 16.6402 21.9135 23.2372 39.8796 45.0858 49.1958 65.8006 72.3495 92.8132 97.4761 116.6147 122.7345 130.8616 154.3755 156.9790 161.8731 171.2927 180.5009 194.2864 199.8041 208.0424 209.4362 222.2646 241.5376 259.0135 286.0838 287.0847 318.2142 336.5702 352.2503 355.2815 362.3761 392.6854 412.1016 420.6186 426.5949 427.0699 444.0429 448.9806 451.4418 480.5752 495.3059 503.3360 503.5606 518.4321 530.1164 538.9454 586.7615 622.2394 623.1227 665.2957 695.4964 702.6336 716.8908 732.9020 749.9526 787.1534 795.9773 803.9354 810.2495 821.2637 824.3687 829.9214 833.8378 839.5302 844.6530 848.0122 935.0978 954.4748 957.5815 957.6938 967.5039 977.3097 985.5289 987.7375 1008.0277 1028.6593 1032.7912 1034.4187 1060.6769 1061.2545 1076.3014 1080.1160 1083.3010 1089.8968 1116.4618 1124.8234 1138.8575 1141.7169 1158.4989 1165.1394 1172.7617 1174.7359 1177.0579 1211.6720 1240.9951 1246.3626 1248.3828 1250.0604 1267.3081 1272.3773 1280.5797 1284.8917 1291.7864 1293.0508 1299.2896 1304.3727 1314.7914 1333.4439 1344.5747 1350.1910 1359.1709 1360.8177 1381.8611 1389.4809 1414.3010 1420.9159 1421.0285 1432.3365 1443.9704 1451.1467 1451.9372 1460.8445 1461.1566 1466.5965 1467.7636 1474.5836 1477.2551 1477.4752 1480.8878 1485.6248 1488.5873 1490.3132 1492.1298 1498.8449 1503.9636 1541.5483 1571.4418 1586.0799 1615.9289 1627.5176 1643.1943 2595.5859 2606.1468 2849.0978 2858.5175 2872.7556 2873.5484 2913.1065 2927.2937 2928.1066 2953.9589 2999.9458 3002.7676 3003.3817 3024.5549 3029.9679 3031.3618 3036.8272 3046.3114 3081.8893 3086.0707 3130.3666 3136.3655 3152.7505 3161.2538 3174.3642 3182.1510 3423.8209 3579.6517
redmass: 2.8680 4.0325 5.5128 5.5483 2.1019 3.4243 5.7572 4.7438 4.1549 3.3972 2.9246 2.6297 2.1312 4.5037 5.1417 5.0521 3.9339 4.1990 5.4432 3.6808 2.6522 6.2618 1.2816 2.9017 1.5522 1.0784 5.0149 3.9957 5.0963 4.2064 3.2336 4.4946 5.7847 3.5510 3.1838 5.5765 7.1077 4.4480 5.1733 4.7569 9.9253 11.7184 5.4185 6.0684 6.1575 4.8827 4.6409 3.7801 3.2152 6.0116 4.7777 5.7776 1.3731 5.5443 6.6307 6.1473 6.3595 9.6072 1.7185 2.5333 1.3180 2.3760 2.1145 1.5500 1.1784 1.1343 3.0233 1.2911 6.1552 1.3321 2.8762 1.7413 5.3788 6.1880 1.0673 1.0665 2.6690 2.9509 1.5687 2.3151 1.6968 1.6598 2.4603 2.2639 2.5343 1.3201 3.3640 1.8856 1.4952 1.6359 3.5325 2.9236 1.1561 1.5623 1.4788 1.2251 1.3847 1.8987 1.7177 1.7308 2.5464 1.1319 4.7786 1.1177 3.8406 2.6392 1.2451 1.4517 1.6181 1.7730 2.4296 1.9509 1.9854 4.8361 1.4410 1.4503 6.1978 1.2058 1.4341 6.9281 1.1580 2.2647 4.2418 1.1729 1.1402 2.1788 1.2925 1.0779 1.0835 1.0720 1.0909 1.0581 1.1180 1.1418 3.6626 1.0910 2.2803 4.9002 2.7458 2.5800 2.7354 2.2419 6.5650 1.0723 1.0704 1.0689 1.0566 1.0710 1.0578 1.0699 1.0644 1.0625 1.0592 1.0920 1.0966 1.0979 1.0735 1.0733 1.0924 1.0924 1.0943 1.1011 1.1007 1.0828 1.0825 1.0862 1.0880 1.0964 1.0976 1.0737 1.0666
irintensity: 0.1397 0.6589 0.1219 0.0579 5.2928 0.9743 0.9228 1.1676 0.0920 3.9748 5.0541 0.3143 1.7008 2.0179 1.3613 0.7380 5.9970 1.1764 3.0439 4.8528 0.4876 1.9935 0.9650 2.0758 1.0839 158.2254 0.4737 4.5009 3.9316 5.7741 12.5968 1.7013 0.0385 9.6693 7.6047 0.1910 0.0889 4.3293 9.2959 0.8770 9.2407 21.7242 23.0256 7.3823 5.4107 0.2723 0.2490 14.0387 0.0916 3.4839 21.1795 0.0050 89.1581 10.7987 0.0023 11.3260 9.7959 0.0120 20.8330 8.2747 7.1072 12.8021 22.1544 67.2943 10.4266 14.0893 30.8994 52.7668 41.1765 0.0283 18.3400 8.0622 35.0084 67.9227 62.6013 224.4392 20.3746 24.2311 10.3680 61.7039 6.4757 14.9663 22.5753 42.7435 13.4669 5.4935 20.9654 24.4261 0.8970 11.4657 134.0462 15.2073 2.1054 2.4098 3.5457 24.5103 32.4574 49.9814 207.5944 119.3473 11.5504 9.3616 326.9384 4.1755 27.1455 27.6014 5.3766 2.4189 2.5775 10.7215 36.0209 79.5455 151.0955 401.4667 7.4795 5.6799 32.9056 3.6185 0.2468 39.8022 5.5481 238.9475 21.1785 63.8545 56.3162 46.8138 20.3387 57.8349 5.1335 2.1248 25.2931 20.4443 31.7313 20.1925 9.4135 6.8000 42.3901 584.2050 132.2075 154.6982 184.1550 46.5669 152.5444 101.5282 84.9428 66.7354 65.7680 78.3203 201.3229 78.9460 57.2755 116.4834 87.8406 15.3447 57.0721 17.9118 43.1998 44.8002 34.3175 35.7919 54.1403 21.8754 71.2178 2.9077 26.5126 4.6437 1.4823 14.9036 11.9254 1.9196 4.2742
temp: 298.150 k
press: 1.00000 atm
elementType: 8 8 8 8 8 7 7 7 7 6 6 6 6 6 6 6 6 6 6 6 6 6 6 6 6 6 6 6 6 6 6 1 1 1 1 1 1 1 1 1 1 1 1 1 1 1 1 1 1 1 1 1 1 1 1 1 1 1 1
symmnumber: 1
zpe: 1248122.5 jmol-1
zpe.correction: 0.475385 hartree
zpe.thermalcorrener: 0.505955 hartree
zpe.thermalcorrenthalpy: 0.506899 hartree
zpe.thermalcorrgfe: 0.409448 hartree
zpe.sumelectzpe: -1447.984771 hartree
zpe.sumelectthermal: -1447.954201 hartree
zpe.sumelectthermalent: -1447.953257 hartree
zpe.sumelectthermalfe: -1448.050708 hartree
dipole: 0.4569 -8.3346 -0.6073
dipole: 8.3691
quadrupole: -166.0745 -178.5775 -185.3274
quadrupole: -8.2596 -6.7785 -0.4348
quadrupole: 10.5853 -1.9177 -8.6676 -8.2596 -6.7785 -0.4348
hfenergy: -1448.4601562 hartree
pointgroup: C01[X(C22H28N4O5)]
dipole: -0.325622 3.2685926 -0.2279712 debye
polarizability: 437.9378524|-24.04796|523.8824332|3.5186177|-8.2118453|153.2270184 unknown
InChI: InChI=1S/C22H28N4O5/c1-26(2)11-9-25-14-4-3-13(24-8-7-23-10-12-27)17-18(14)22(31)20-16(29)6-5-15(28)19(20)21(17)30/h3-6,23-25,27-29H,7-12H2,1-2H3
charge 0 multiplicity 1
59 atoms
O  3.417742 -0.845577 0.031281
O  -2.005583 -2.079938 -0.069118
O  3.989362 -3.277708 0.113564
O  -1.470349 -4.521612 0.012984
O  -9.792104 1.924648 0.301935
N  2.887822 1.672825 -0.061265
N  -2.614979 0.420223 -0.146261
N  5.538538 4.357886 -0.03793
N  -6.118744 1.759454 -0.267623
C  1.125238 -0.033391 -0.051863
C  -0.288714 -0.355301 -0.075415
C  1.55476 1.345791 -0.083287
C  -1.270887 0.702367 -0.128386
C  1.673712 -2.489426 0.033482
C  0.276765 -2.80763 0.007365
C  2.108544 -1.102178 0.004389
C  -0.714451 -1.745032 -0.046721
C  0.546725 2.373156 -0.140715
C  -0.805551 2.065017 -0.163255
C  3.416154 3.040607 -0.079772
C  -3.678525 1.425994 -0.206045
C  4.959286 2.999237 -0.106697
C  2.641264 -3.543274 0.087337
C  -0.1403 -4.176865 0.035866
C  -5.058554 0.746688 -0.107698
C  2.2046 -4.900041 0.114475
C  0.839748 -5.210942 0.089235
C  -7.488271 1.295859 0.049006
C  5.51916 4.932006 1.324298
C  6.883688 4.438116 -0.645583
C  -8.454842 2.485542 0.05545
H  0.855159 3.422026 -0.168785
H  -1.535862 2.877652 -0.209225
H  3.520197 0.842358 -0.013486
H  -2.827145 -0.602781 -0.128839
H  3.067118 3.595932 -0.972966
H  3.066668 3.601836 0.811671
H  -3.618487 1.999713 -1.158009
H  -3.5900 2.15815 0.620858
H  5.325337 2.338161 0.721006
H  5.279176 2.531683 -1.056424
H  -5.166833 0.287041 0.892839
H  -5.115108 -0.084813 -0.853975
H  2.964803 -5.685297 0.155506
H  0.49339 -6.248186 0.110022
H  -6.077078 2.200336 -1.197925
H  -7.480078 0.840125 1.055933
H  -7.877774 0.525316 -0.656958
H  6.164726 4.368093 2.044446
H  5.875558 5.976585 1.288849
H  4.49151 4.943578 1.726339
H  7.220884 5.490057 -0.654328
H  7.655411 3.835642 -0.103542
H  6.84357 4.085264 -1.69105
H  4.070792 -2.233179 0.086788
H  -1.996342 -3.616539 -0.024919
H  -8.154021 3.201841 0.846797
H  -8.421101 3.010033 -0.926306
H  -10.448525 2.659268 0.393448
