program: Gaussian 09
title: 000131798
version: EM64L-G09RevD.01
frameworkgroup: C1[X(C16H10N6)]
method: RPBEPBE
basis: SDD
operation: Freq
keyword: #pfreq=noraman
keyword: PBEPBE/SDD
title: #p freq=noraman PBEPBE/SDD
converged: YES YES NO NO
title: Mulliken charges:
elementType: N N N N N N C C C C C C C C C C C C C C C C H H H H H H H H H H
charge: -0.147432 -0.041338 -0.026670 -0.096515 -0.009090 -0.008168 -0.390511 0.474829 0.512716 -0.397059 -0.405831 -0.368833 -0.311442 -0.372125 -0.372293 -0.382902 -0.373639 0.400797 0.401999 -0.227994 -0.252905 -0.251327 0.269393 0.241817 0.247278 0.293866 0.258905 0.262306 0.262981 0.263944 0.262361 0.282882
chargesum: 0.00000
title: Mulliken charges with hydrogens summed into heavy atoms:
elementType: N N N N N N C C C C C C C C C C C C C C C C
charge: -0.147432 -0.041338 -0.026670 -0.096515 -0.009090 -0.008168 -0.121118 0.474829 0.512716 -0.155242 -0.158553 -0.074967 -0.052538 -0.109819 -0.109312 -0.118958 -0.111278 0.400797 0.401999 0.054888 -0.252905 -0.251327
polarizability: 2.74199577e+02 -5.00300189e+00 1.99501788e+02 -1.15646680e+01 9.10726641e+00 1.61410351e+02
1716.lowfreq: -18.2713 -4.1889 -0.0005 -0.0004 -0.0002 2.6446 6.8955 28.9781 36.5601
frequency: -17.5231 28.9440 36.5255 38.5279 51.4042 84.2826 101.3016 111.6014 137.9759 160.0194 226.0408 243.3905 257.0375 268.0610 298.9594 311.4889 399.6418 403.2107 422.1635 462.7067 488.8954 520.2294 544.7869 545.8374 568.1579 575.9027 634.5967 638.8491 666.3568 681.9434 717.0063 725.3396 748.4105 763.8389 769.5876 824.5948 829.8799 846.0491 854.7813 861.2944 873.0048 882.2276 912.1051 958.6185 974.6883 978.4732 986.7858 1003.1674 1007.1020 1013.9578 1016.9099 1080.3758 1121.2432 1122.6019 1135.8285 1177.6652 1191.3228 1195.7961 1205.1766 1210.6334 1212.7012 1225.1867 1258.2134 1281.8072 1312.6048 1319.5855 1328.6998 1357.1131 1374.8048 1381.4851 1411.7174 1413.8970 1497.9894 1500.1193 1567.6464 1571.3128 1617.3773 1620.4282 2182.4594 2182.6739 3049.3954 3133.2046 3133.7690 3145.4018 3154.7349 3166.0533 3167.7630 3169.6212 3174.7864 3277.0342
redmass: 3.8855 7.2221 6.0260 5.0164 10.2278 10.5168 8.6289 8.7192 9.1363 8.0117 7.5888 8.4816 6.0123 6.9936 7.6036 6.2890 2.8297 2.8890 6.3532 6.3062 7.5289 7.6947 7.7218 7.3744 3.3773 3.2414 7.1449 7.3542 7.3430 5.2799 4.1235 4.2077 6.1629 4.8499 4.1796 2.9507 1.3920 2.2850 1.2769 1.4589 2.5681 1.7169 8.0279 9.9908 1.4173 1.3807 1.4038 1.3586 4.6136 3.0404 3.3041 2.5718 2.1905 1.6422 2.3169 3.5988 1.8304 1.6936 1.7477 1.9348 1.6274 3.3969 1.8366 9.2266 1.3511 1.3820 1.8653 3.8656 2.9460 2.5043 2.9493 2.8261 2.4525 2.4561 6.8292 6.6061 6.1611 6.1290 12.6317 12.6320 1.0845 1.0898 1.0897 1.0896 1.0885 1.0960 1.0961 1.0973 1.0977 1.1007
irintensity: 0.1773 1.1067 0.3243 0.2631 3.2207 3.5220 1.5870 1.5286 3.5411 6.1563 0.0604 0.7483 0.8910 2.4321 2.3284 0.1755 0.1937 0.2238 0.3719 0.4667 13.9714 2.4406 0.4463 0.2937 20.3537 24.0311 1.3182 0.2749 2.6552 9.1470 6.6555 10.6716 3.6232 5.1847 16.7842 54.9287 26.0598 48.2350 1.2691 0.6390 36.5853 23.8237 38.9044 3.8136 1.8614 0.5308 0.5736 0.2224 5.4092 10.5883 2.2892 16.8503 4.0661 6.6668 15.9815 2.5822 0.5629 2.0959 7.4712 0.7786 2.4730 9.3040 7.7960 32.1961 3.8950 0.7878 0.4016 1.5419 0.8120 1.3970 15.2091 7.8437 19.5087 21.2320 1.6153 1.4814 12.7714 6.5995 42.6943 13.3137 1.0023 5.0852 7.1656 1.1556 1.9344 3.6134 5.3386 2.1699 0.7827 0.6177
temp: 298.150 k
press: 1.00000 atm
elementType: 7 7 7 7 7 7 6 6 6 6 6 6 6 6 6 6 6 6 6 6 6 6 1 1 1 1 1 1 1 1 1 1
symmnumber: 1
zpe: 598652.5 jmol-1
zpe.correction: 0.228015 hartree
zpe.thermalcorrener: 0.245049 hartree
zpe.thermalcorrenthalpy: 0.245993 hartree
zpe.thermalcorrgfe: 0.180706 hartree
zpe.sumelectzpe: -942.642036 hartree
zpe.sumelectthermal: -942.625002 hartree
zpe.sumelectthermalent: -942.624058 hartree
zpe.sumelectthermalfe: -942.689345 hartree
dipole: -0.1037 2.6577 3.7260
dipole: 4.5779
quadrupole: -179.1006 -138.4333 -120.8289
quadrupole: -1.9426 -5.8265 2.0866
quadrupole: -32.9796 7.6876 25.2920 -1.9426 -5.8265 2.0866
hfenergy: -942.8700508 hartree
pointgroup: C01 [X(C16H10N6)]
dipole: -0.0087815 1.0489573 -1.464075 debye
polarizability: 273.5595947|8.001756|200.0660737|-11.7025347|-9.5424431|161.4860477 unknown
InChI: InChI=1S/C16H10N6/c17-9-12-1-5-14(6-2-12)16(22-20-11-19-21-22)15-7-3-13(10-18)4-8-15/h1-8,11,16H
charge 0 multiplicity 1
32 atoms
N  0.01496 2.212627 -0.165089
N  -0.003968 3.363203 -0.917378
N  0.131028 2.443781 1.206262
N  0.179373 3.794697 1.334271
N  -5.903807 -2.757431 0.503739
N  5.854311 -2.650269 0.629806
C  -0.044618 0.863099 -0.789327
C  -1.34448 0.12024 -0.465429
C  1.230248 0.068672 -0.458948
C  -1.8748 -0.745674 -1.455476
C  2.348357 0.18277 -1.322617
C  -2.007931 0.231645 0.782035
C  1.321917 -0.752908 0.690257
C  -3.043805 -1.489971 -1.212528
C  3.541983 -0.51138 -1.049014
C  -3.182372 -0.504972 1.032497
C  2.510707 -1.450419 0.97538
C  -3.70898 -1.373725 0.038865
C  3.630304 -1.335487 0.106152
C  0.098111 4.3210 0.04928
C  -4.909201 -2.128001 0.293331
C  4.846631 -2.052503 0.391313
H  -0.035534 1.09104 -1.869662
H  -1.371027 -0.840033 -2.424601
H  2.287784 0.822084 -2.211276
H  -1.611405 0.898548 1.554101
H  0.465377 -0.849887 1.363716
H  -3.449187 -2.153835 -1.982068
H  4.40328 -0.42303 -1.717953
H  -3.69512 -0.412438 1.994861
H  2.581419 -2.083393 1.865053
H  0.116745 5.38445 -0.165953
