program: Gaussian 09
title: 000131796
version: EM64L-G09RevD.01
frameworkgroup: C1[X(C17H14N6O)]
method: RPBEPBE
basis: SDD
operation: Freq
keyword: #p
keyword: freq=noraman
keyword: PBEPBE/SDD
title: #p freq=noraman PBEPBE/SDD
converged: YES YES NO NO
title: Mulliken charges:
elementType: O N N N N N N C C C C C C C C C C C C C C C C C H H H H H H H H H H H H H H
charge: -0.215175 -0.249094 -0.283783 -0.190137 -0.079291 -0.033657 -0.022080 -0.320037 -0.471507 -0.472713 0.297973 0.214431 -0.353398 0.084212 -0.065997 0.197663 0.308922 -0.510744 0.036153 -0.264907 -0.337557 -0.333792 -0.247652 -0.225470 0.268540 0.249054 0.253745 0.253609 0.258473 0.236654 0.291083 0.236546 0.237613 0.263474 0.280853 0.233425 0.238402 0.236165
chargesum: 0.00000
title: Mulliken charges with hydrogens summed into heavy atoms:
elementType: O N N N N N N C C C C C C C C C C C C C C C C C
charge: -0.215175 -0.249094 -0.283783 -0.190137 -0.079291 -0.033657 -0.022080 -0.051497 0.031292 0.039368 0.297973 0.214431 0.174339 0.084212 -0.065997 0.197663 0.308922 -0.036586 0.036153 -0.001433 -0.056704 -0.100367 -0.009249 0.010696
polarizability: 3.55056142e+02 4.60342414e+00 2.56070027e+02 -9.69611388e+00 -1.66555525e+00 1.13261379e+02
1716.lowfreq: -4.5808 -0.0008 -0.0007 -0.0005 0.9472 6.4394 17.2248 32.1011 56.7928
frequency: 17.1138 32.0781 56.7860 64.5501 72.7087 93.9452 106.8351 124.4449 150.6514 157.3068 207.9651 226.4033 246.4844 268.5722 283.3353 315.3715 351.2797 394.0372 404.6536 413.7025 428.2352 447.5653 476.9354 496.8043 523.5055 627.6359 634.0262 645.3378 648.6353 662.7717 669.6255 693.4626 716.5064 734.3445 742.4524 745.4995 757.6693 773.4998 787.8149 791.2340 797.9279 819.0678 876.6732 880.2719 882.8357 885.2240 914.0269 933.3458 937.6042 952.3241 965.1673 967.8401 1000.1568 1002.4897 1039.8279 1050.3392 1063.8793 1071.8345 1076.1138 1078.2997 1095.8926 1101.3686 1111.0281 1133.9434 1146.6318 1174.8467 1178.8893 1186.4387 1198.6497 1200.1580 1217.8862 1258.1177 1259.8843 1274.5936 1296.8489 1306.6259 1321.2573 1340.8268 1384.1772 1388.5495 1397.1797 1434.5464 1450.4514 1459.9754 1469.1337 1472.6122 1479.4229 1497.1685 1509.5639 1554.3864 1579.7740 1609.8976 1617.3715 1627.0632 2995.6019 3003.2317 3057.7055 3100.5605 3105.6670 3113.0885 3141.3652 3156.0856 3166.2104 3168.1735 3178.0986 3209.5545 3228.2391 3252.6064
redmass: 4.8315 4.6018 6.1108 3.3836 2.5703 4.0294 3.2473 5.4803 4.3836 3.9474 4.5477 5.4363 5.3351 7.3517 4.9246 6.5435 5.0502 5.9111 6.7434 6.6555 6.4200 3.4543 7.8602 7.3280 3.8507 6.5264 3.5874 4.8219 5.0855 4.4215 4.2704 7.2360 7.2045 2.6055 3.9306 3.5870 3.4244 1.3350 1.1654 7.3980 2.4357 1.4687 6.5316 1.4317 2.0622 4.2500 7.2898 7.2170 5.6426 7.0225 3.8363 1.3720 1.3361 6.1766 2.5058 1.2224 3.1628 1.6876 1.2047 1.6909 1.2290 3.0302 4.7877 3.1211 3.7070 1.3872 1.1018 1.1560 1.9985 2.2798 1.0941 2.6679 3.0027 2.5665 1.7182 3.6212 1.5281 2.1396 3.5950 2.5194 4.0727 1.0858 4.6874 1.3403 1.2452 2.7293 2.8185 1.1531 7.9348 9.8542 7.3982 10.5740 8.5580 7.8406 1.0667 1.0644 1.1015 1.0987 1.0507 1.0617 1.0863 1.0901 1.0912 1.0950 1.1005 1.1183 1.1156 1.0980
irintensity: 0.8825 0.1387 0.1017 1.0622 2.5707 1.5358 0.7845 0.3032 0.3399 2.1358 6.9148 0.9986 5.5697 4.8602 1.7091 0.1233 0.6671 0.7478 1.5336 7.4870 0.4541 1.4488 3.1031 4.6723 10.5938 1.3710 6.0431 5.5481 12.0074 2.4269 2.1592 0.6601 1.0058 17.3523 1.6533 3.1188 5.6007 87.4028 13.8385 55.8468 9.2672 5.6525 26.8949 0.0371 7.6932 28.0942 1.3900 16.1220 11.4863 12.2228 8.8924 2.6544 0.3667 20.2808 5.2681 31.1445 19.5533 1.1667 14.5370 5.7898 0.1008 3.9468 81.7355 100.5191 29.3846 1.5801 2.3550 1.5747 1.8784 1.7332 0.4596 4.7705 58.0793 63.3677 12.6775 17.3247 23.3892 0.5120 35.5505 10.9542 23.4496 11.3816 3.9514 1.9899 7.1096 146.1805 110.6820 85.9876 111.8272 201.9692 56.3354 147.1972 334.7009 79.2427 17.9841 58.3600 21.4162 11.9172 14.5449 7.6701 2.5490 10.1518 1.9556 7.1047 17.0816 0.4920 18.1479 0.0967
temp: 298.150 k
press: 1.00000 atm
elementType: 8 7 7 7 7 7 7 6 6 6 6 6 6 6 6 6 6 6 6 6 6 6 6 6 1 1 1 1 1 1 1 1 1 1 1 1 1 1
symmnumber: 1
zpe: 752441.4 jmol-1
zpe.correction: 0.286590 hartree
zpe.thermalcorrener: 0.305366 hartree
zpe.thermalcorrenthalpy: 0.306310 hartree
zpe.thermalcorrgfe: 0.237657 hartree
zpe.sumelectzpe: -1058.201089 hartree
zpe.sumelectthermal: -1058.182313 hartree
zpe.sumelectthermalent: -1058.181369 hartree
zpe.sumelectthermalfe: -1058.250022 hartree
dipole: -1.5047 3.8884 0.9872
dipole: 4.2847
quadrupole: -103.5803 -150.7021 -140.4119
quadrupole: 28.0003 1.2800 -4.4511
quadrupole: 27.9845 -19.1373 -8.8471 28.0003 1.2800 -4.4511
hfenergy: -1058.487679 hartree
pointgroup: C01 [X(C17H14N6O1)]
dipole: -0.5974991 1.5631261 0.203259 debye
polarizability: 355.3863001|3.9415101|253.9554488|-4.7587945|-17.2645849|115.0457997 unknown
InChI: InChI=1S/C17H14N6O/c1-2-4-12-11(3-1)15-18-7-8-22(15)17-13(19-9-23(12)17)14-20-16(24-21-14)10-5-6-10/h1-4,9-10H,5-8H2
charge 0 multiplicity 1
38 atoms
O  4.233136 -1.77973 -0.204058
N  -0.514595 0.857989 -0.348311
N  -1.616009 -1.21198 0.118335
N  2.764184 -0.099783 0.215534
N  -1.676223 2.834276 -0.698579
N  0.061867 -2.72966 0.250916
N  2.878081 -2.372019 -0.326706
C  5.246023 0.400385 0.300747
C  5.189378 1.899106 -0.084734
C  5.229737 1.506152 1.385657
C  4.050995 -0.429045 0.114328
C  -0.41063 -0.493815 -0.085068
C  0.567818 1.791994 -0.768012
C  -1.757627 1.554678 -0.400683
C  0.627072 -1.450529 0.013801
C  -2.98519 0.793896 -0.134443
C  -2.901354 -0.605676 0.120352
C  -0.217231 3.146793 -0.868426
C  2.071126 -1.305785 -0.051111
C  -1.255827 -2.56145 0.313246
C  -4.250935 1.428385 -0.140612
C  -4.077036 -1.354072 0.366579
C  -5.420136 0.685082 0.103291
C  -5.327901 -0.707031 0.356602
H  6.185587 -0.131395 0.133852
H  4.240537 2.259556 -0.490823
H  6.085144 2.324745 -0.544489
H  6.154704 1.657762 1.948024
H  4.308083 1.600338 1.965531
H  0.981236 1.462773 -1.740227
H  1.386532 1.784795 -0.034337
H  0.087442 3.855574 -0.075882
H  -0.060572 3.646012 -1.840263
H  -1.979673 -3.348058 0.500376
H  -4.281581 2.50358 -0.341699
H  -4.022441 -2.427989 0.566295
H  -6.396905 1.178593 0.097912
H  -6.234715 -1.290244 0.548283
