program: Gaussian 09
title: 000131782
version: EM64L-G09RevD.01
frameworkgroup: C1[X(C24H27ClN2O5)]
method: RPBEPBE
basis: SDD
operation: Freq
keyword: #p
keyword: freq=noraman
keyword: PBEPBE/SDD
title: #p freq=noraman PBEPBE/SDD
converged: YES YES NO NO
title: Mulliken charges:
elementType: Cl O O O O O N N C C C C C C C C C C C C C C C C C C C C C C C C H H H H H H H H H H H H H H H H H H H H H H H H H H H
charge: -0.046670 -0.265542 -0.264050 -0.454258 -0.446525 -0.256485 -0.234567 -0.002589 -0.590816 0.185087 -0.466556 0.537812 -0.348906 0.618933 -0.351062 -0.464918 -0.675732 -0.580276 -0.029552 -0.489318 0.269282 0.270673 0.361337 -0.703091 0.092817 -0.358341 -0.331268 -0.236434 -0.232836 -0.539408 -0.535788 0.083451 0.279087 0.237724 0.268467 0.205374 0.206744 0.209758 0.182384 0.213843 0.243786 0.263355 0.231862 0.208756 0.210756 0.210932 0.211601 0.244586 0.349460 0.278776 0.229906 0.232487 0.217434 0.232958 0.246162 0.223970 0.217374 0.247403 0.380649
chargesum: 0.00000
title: Mulliken charges with hydrogens summed into heavy atoms:
elementType: Cl O O O O O N N C C C C C C C C C C C C C C C C C C C C C C C C
charge: -0.046670 -0.265542 -0.264050 -0.104798 -0.065876 -0.256485 -0.234567 -0.002589 -0.074005 0.185087 0.007285 0.537812 0.067595 0.618933 0.045166 -0.464918 -0.431947 -0.316921 -0.029552 -0.048700 0.269282 0.270673 0.361337 -0.069801 0.092817 -0.113755 -0.052491 -0.006528 -0.000349 0.157145 0.152960 0.083451
polarizability: 3.77450837e+02 3.70629148e+00 2.85640650e+02 9.31807420e+00 -1.52017696e+01 2.56206635e+02
1716.lowfreq: -5.7666 -3.8977 -0.0007 -0.0004 0.0007 3.4029 11.3278 12.8855 16.1153
frequency: 11.0066 12.7030 16.0690 21.1259 27.1012 40.6251 45.5655 61.5811 63.0325 66.1642 69.4447 82.1812 95.2604 106.4687 111.3492 125.6914 137.6936 139.1285 149.9701 164.0681 177.9878 189.9487 195.1510 200.6081 220.9435 236.1007 242.0775 248.4425 252.8466 262.2942 265.0062 276.2733 279.7601 298.7112 334.3246 344.2492 356.8484 374.7496 386.5842 412.1565 431.2700 436.6299 458.3338 474.1603 510.7355 530.6115 543.1576 577.9429 582.6595 586.2267 599.9316 604.0935 609.1501 630.0321 657.4050 665.4187 687.8061 692.1652 698.9586 730.7083 752.1485 762.9478 771.5173 780.3249 793.8208 795.1861 811.3932 832.2570 838.7183 873.2142 894.4653 898.7558 913.8256 924.0531 941.4484 944.1964 972.2058 988.1396 995.6712 1001.1348 1002.6383 1011.1400 1023.1091 1046.0669 1047.6660 1081.9051 1092.1519 1106.7797 1111.4493 1112.0047 1112.4543 1112.5334 1152.9526 1157.2739 1158.8883 1159.3835 1164.8975 1176.9591 1188.0159 1210.5723 1210.7213 1226.4201 1233.9614 1245.0598 1253.2620 1261.2773 1281.4800 1282.8047 1290.4847 1300.0676 1304.6490 1314.7737 1335.1264 1357.5073 1364.7817 1373.8335 1388.3731 1390.4066 1397.6960 1408.9836 1414.5149 1427.2716 1442.1917 1448.8592 1454.4302 1465.3740 1467.6601 1467.9815 1468.2914 1469.2493 1473.1244 1475.5531 1476.3976 1477.3155 1482.1625 1488.8821 1492.5544 1514.4909 1567.8243 1574.2741 1596.2900 1605.7207 1612.4045 1639.2474 2931.1398 2946.8667 2959.0541 2959.5468 2963.4147 2971.3778 2994.7305 2999.4874 3001.0116 3005.4027 3022.3166 3048.1051 3053.6666 3055.3991 3056.1568 3068.8881 3070.4059 3124.8086 3126.9973 3130.5749 3147.6853 3149.6868 3160.2747 3162.3351 3183.0103 3527.4802 3542.1759
redmass: 5.5936 5.0167 4.3999 8.5244 4.2290 5.6171 9.4122 3.0541 3.3123 3.7431 2.5242 4.0486 4.2266 3.5018 2.3658 4.3552 5.1120 5.7998 5.0796 4.0987 3.6415 3.2662 1.9778 3.0211 2.6442 1.2431 3.2532 4.7165 1.3410 3.3705 1.1895 4.3355 1.6888 3.5363 5.8888 3.6673 5.2527 7.4617 3.3594 3.6427 5.4554 6.7816 5.5922 5.3434 5.9524 4.8547 4.1209 5.1230 4.4883 1.2810 4.3043 4.3150 3.8233 4.4041 5.7147 4.4714 4.4031 5.5820 4.2279 1.1188 2.5780 2.7547 4.2310 2.4005 1.9579 1.6470 3.5695 2.0258 1.6921 5.8758 1.4892 1.7880 8.2528 1.2759 3.2344 3.8293 1.4007 6.2778 5.9979 1.3634 2.3708 5.1162 2.9207 2.2662 3.0180 2.2956 7.3756 2.3276 1.6590 1.3394 1.3439 1.3900 1.6748 1.4265 1.6924 1.5620 1.3823 1.0795 1.7756 1.3914 1.1888 1.5697 4.3499 2.1317 2.1794 1.4549 1.1819 1.8265 1.0682 2.4137 2.4261 2.9410 1.5068 1.7156 2.5714 10.0248 1.4635 2.1226 1.9818 2.4521 2.0855 2.1284 1.2086 1.5122 1.3012 1.8231 1.0939 1.0645 1.0884 1.0506 1.0544 1.3457 1.1230 1.0426 1.3303 1.0863 2.2426 3.5399 9.0835 6.9652 8.0146 6.3859 7.0698 8.4288 1.0658 1.0627 1.0590 1.0336 1.0329 1.0361 1.0766 1.0741 1.0663 1.1002 1.0957 1.1038 1.1039 1.1002 1.1028 1.0994 1.1012 1.0994 1.0999 1.0859 1.0913 1.0904 1.0908 1.0976 1.0961 1.0641 1.0664
irintensity: 0.2287 0.2082 0.0414 0.3981 0.5378 0.5278 0.9735 0.6185 7.1904 0.3783 0.6785 4.1224 4.8648 0.3163 0.2219 1.2858 1.4743 2.9075 7.6384 0.6766 0.4098 9.6943 0.8612 1.0177 7.0890 2.6824 8.4236 2.2275 5.6776 0.7286 134.7896 0.7028 0.1225 0.0300 3.4159 3.4332 0.8998 7.3629 2.0192 7.8410 3.8925 6.1715 9.8583 1.2768 12.1890 9.3716 9.7285 25.8027 9.4827 80.2241 3.1452 25.6774 3.4350 1.6206 2.1554 4.0120 32.5791 11.9392 21.2583 10.2902 17.3667 54.8465 5.2861 16.1814 7.5460 6.0390 7.4065 18.1027 19.0184 1.5354 0.3590 9.0802 77.8552 1.1154 5.7787 22.9390 3.5989 166.0130 112.5301 1.2880 0.5814 1.4247 9.4850 8.0413 9.0870 1.2756 256.0045 7.4266 53.2599 11.1536 0.0138 4.2670 14.9969 57.2264 53.7688 19.3830 2.6533 0.7656 26.5612 7.1863 15.8232 90.7295 87.6810 72.7433 4.4732 12.2688 1.0276 2.3748 0.5891 3.0939 63.3267 55.6139 7.5164 9.3840 26.6775 8.7294 6.1585 28.0111 21.2176 119.5973 55.5979 2.6167 2.1606 60.9896 1.8426 37.0777 9.2233 9.9994 6.2434 13.8259 44.3378 5.7712 5.5735 11.4675 12.6154 13.5430 34.8786 7.0968 31.5166 27.1006 149.2850 23.0225 45.0630 357.8740 64.5445 10.5162 23.5353 79.9900 54.1779 39.7131 18.7336 11.9988 21.0791 6.6172 24.6848 39.4208 34.9345 7.9631 4.6603 51.5566 96.9680 21.8879 20.3696 2.4378 20.3900 8.2810 3.5429 21.7377 10.1085 34.2332 2.9976
temp: 298.150 k
press: 1.00000 atm
elementType: 17 8 8 8 8 8 7 7 6 6 6 6 6 6 6 6 6 6 6 6 6 6 6 6 6 6 6 6 6 6 6 6 1 1 1 1 1 1 1 1 1 1 1 1 1 1 1 1 1 1 1 1 1 1 1 1 1 1 1
symmnumber: 1
zpe: 1220841.1 jmol-1
zpe.correction: 0.464994 hartree
zpe.thermalcorrener: 0.498178 hartree
zpe.thermalcorrenthalpy: 0.499123 hartree
zpe.thermalcorrgfe: 0.394975 hartree
zpe.sumelectzpe: -1874.051289 hartree
zpe.sumelectthermal: -1874.018105 hartree
zpe.sumelectthermalent: -1874.017160 hartree
zpe.sumelectthermalfe: -1874.121308 hartree
dipole: 3.7659 -4.2967 1.5953
dipole: 5.9320
quadrupole: -209.8238 -175.4170 -177.4943
quadrupole: 15.9415 -0.1282 -0.3057
quadrupole: -22.2454 12.1613 10.0840 15.9415 -0.1282 -0.3057
hfenergy: -1874.5162831 hartree
pointgroup: C01 [X(C24H27Cl1N2O5)]
dipole: 1.7498481 -0.0535976 -1.5433519 debye
polarizability: 350.7600565|-51.3556552|280.8935413|-1.7683731|-14.328938|287.6445238 unknown
InChI: InChI=1S/C24H27ClN2O5/c1-4-5-10-21-26-23(25)18(14-28)27(21)13-15-11-19(31-2)22(20(12-15)32-3)16-8-6-7-9-17(16)24(29)30/h6-9,11-12,28-29H,4-5,10,13-14H2,1-3H3
charge 0 multiplicity 1
59 atoms
Cl -5.41769 3.7990 0.485039
O  1.704264 1.439109 0.722706
O  2.009318 -2.117343 -2.414871
O  -3.880555 3.046414 -3.644488
O  2.344867 -2.27872 3.046298
O  0.820204 -1.760813 1.38861
N  -3.068526 1.170059 -1.34071
N  -4.329192 1.240008 0.538758
C  -2.168433 0.665733 -2.394857
C  -3.500697 0.468009 -0.211355
C  -3.083198 -0.939913 0.112009
C  -3.657339 2.454852 -1.30784
C  -3.689817 -1.460073 1.433328
C  -0.761809 0.358168 -1.884961
C  -3.159676 -2.865983 1.792516
C  -4.419411 2.437574 -0.1385
C  -0.045409 -0.717302 -2.449549
C  -0.193785 1.125861 -0.845634
C  1.809831 -0.323658 -0.86541
C  -3.409849 3.521476 -2.313025
C  1.078424 0.773401 -0.339688
C  1.236236 -1.045297 -1.9422
C  3.122194 -0.731482 -0.272274
C  -3.747139 -3.398227 3.117207
C  3.231008 -1.39328 0.990974
C  4.311498 -0.431345 -0.979199
C  4.513655 -1.714143 1.514174
C  5.580962 -0.760801 -0.458797
C  5.683862 -1.400971 0.797677
C  0.968098 2.522787 1.379119
C  1.433787 -2.969419 -3.456985
C  2.019285 -1.79404 1.760347
H  -2.159558 1.421475 -3.199764
H  -2.610132 -0.248302 -2.834909
H  -1.977264 -0.996571 0.173444
H  -3.373583 -1.616597 -0.720751
H  -4.793993 -1.471509 1.358392
H  -3.448387 -0.748258 2.245285
H  -3.401246 -3.57361 0.972047
H  -2.052801 -2.830543 1.858601
H  -0.501873 -1.31145 -3.247144
H  -0.7681 1.945615 -0.405832
H  -3.961824 4.426013 -1.99216
H  -2.327446 3.770408 -2.379705
H  -3.493959 -2.726894 3.959523
H  -3.359851 -4.405761 3.357581
H  -4.850394 -3.462995 3.064356
H  4.22994 0.07105 -1.948436
H  -3.792887 3.789563 -4.295977
H  4.572092 -2.215347 2.483452
H  6.48428 -0.515728 -1.028654
H  6.665323 -1.655869 1.211581
H  0.769003 3.356264 0.677684
H  0.013931 2.158917 1.805585
H  1.630223 2.868694 2.186192
H  0.499553 -3.451966 -3.110235
H  1.23562 -2.397928 -4.384892
H  2.197407 -3.736757 -3.651264
H  1.498163 -2.545456 3.49508
