program: Gaussian 09
title: 000131780
version: EM64L-G09RevD.01
frameworkgroup: C1[X(C24H27ClN2O5)]
method: RPBEPBE
basis: SDD
operation: Freq
keyword: #p
keyword: freq=noraman
keyword: PBEPBE/SDD
title: #p freq=noraman PBEPBE/SDD
converged: YES YES NO NO
title: Mulliken charges:
elementType: Cl O O O O O N N C C C C C C C C C C C C C C C C C C C C C C C C H H H H H H H H H H H H H H H H H H H H H H H H H H H
charge: -0.030108 -0.264691 -0.263338 -0.457886 -0.448293 -0.256864 -0.133012 -0.107117 0.194351 -0.464367 -0.582539 -0.351909 0.621728 -0.254816 0.334220 -0.353184 -0.560060 -0.677056 -0.043248 0.277170 0.269213 0.363667 -0.481383 -0.705150 0.090206 -0.356551 -0.328846 -0.237605 -0.232720 0.086062 -0.537539 -0.539080 0.269619 0.200171 0.244609 0.239080 0.202551 0.214314 0.179557 0.221064 0.269947 0.241857 0.214725 0.199726 0.213287 0.208628 0.210103 0.246083 0.279363 0.230173 0.232129 0.341006 0.246865 0.218122 0.222820 0.242995 0.239455 0.222310 0.380187
chargesum: 0.00000
title: Mulliken charges with hydrogens summed into heavy atoms:
elementType: Cl O O O O O N N C C C C C C C C C C C C C C C C C C C C C C C C
charge: -0.030108 -0.264691 -0.263338 -0.116881 -0.068107 -0.256864 -0.133012 -0.107117 0.194351 0.005424 -0.098849 0.064957 0.621728 -0.254816 0.334220 0.047437 -0.290113 -0.435199 -0.043248 0.277170 0.269213 0.363667 -0.066933 -0.073132 0.090206 -0.110468 -0.049483 -0.007432 -0.000590 0.086062 0.150268 0.165679
polarizability: 3.66170417e+02 8.34951121e+00 2.91107578e+02 -1.03011685e-01 2.82546443e+00 2.57878771e+02
1716.lowfreq: -5.9477 -2.6027 -0.0011 -0.0011 -0.0009 0.5529 4.8570 12.4898 18.5176
frequency: 3.1379 12.1114 18.5002 20.7530 30.5023 39.7810 40.9281 51.7864 61.1861 62.3837 73.1985 74.6744 88.1539 107.3805 110.1542 124.0203 128.6896 136.9280 139.1354 162.2947 177.0184 191.2134 195.2077 207.9253 222.4036 227.6528 231.6841 242.1296 252.1762 252.7608 262.2774 275.8950 277.4386 281.3220 313.7855 347.8574 356.7397 375.4824 395.8814 417.8887 427.9525 441.6651 457.6847 474.9719 509.7101 530.1437 540.2918 579.2388 586.5887 587.3944 598.4799 605.8321 610.0033 614.0755 635.9292 663.0889 690.3728 694.1925 719.5997 731.9302 737.5591 755.0343 773.0746 774.8495 794.4490 795.8135 823.1138 840.5109 849.3194 872.2263 895.1459 896.7023 923.0829 924.1666 941.4168 959.0067 974.0962 985.6750 988.0170 995.5122 1001.9777 1009.9668 1026.2658 1040.4376 1046.0427 1081.0368 1091.8718 1104.0331 1109.6249 1111.1162 1111.5844 1113.5522 1141.6829 1157.1221 1158.5257 1159.3463 1168.7472 1177.2563 1185.7902 1196.6479 1199.8504 1209.9726 1231.9489 1253.6993 1255.5575 1281.7429 1282.2502 1289.0372 1299.1986 1303.8208 1310.2289 1312.4612 1338.3748 1355.0963 1357.7650 1374.0987 1383.3764 1389.4291 1397.7623 1405.6724 1415.0493 1427.1377 1441.9680 1448.9880 1456.1841 1459.8285 1465.2815 1467.3032 1468.5687 1469.5282 1471.4401 1472.9949 1475.7567 1476.2674 1478.3223 1490.2346 1496.8732 1516.0648 1571.8183 1574.6470 1598.4650 1605.3447 1613.5802 1638.0947 2944.9402 2958.9691 2959.6482 2963.3518 2968.0468 2970.0384 2995.1262 3000.4828 3003.5575 3008.1561 3024.3561 3047.4498 3053.1162 3056.4149 3060.1351 3066.2052 3069.9001 3124.0586 3128.9111 3130.2510 3147.1473 3149.6954 3161.8879 3164.1070 3183.1433 3529.6568 3542.8062
redmass: 6.2595 4.3080 5.4468 5.5829 4.8444 5.7353 8.2061 4.7565 3.5725 4.8555 2.4430 2.2738 4.5697 3.3041 2.9458 4.2014 4.1987 6.4989 3.9015 3.9954 3.2481 1.9096 2.2737 1.2424 2.4632 1.6068 2.0481 4.0073 1.5860 5.3673 4.0044 4.3813 1.7652 3.0530 5.9509 3.6080 4.6784 7.3579 3.2252 3.2673 6.7218 5.8038 7.1589 5.3435 5.9026 4.8173 4.0267 5.7682 1.7437 2.2346 4.3818 5.0401 3.6830 4.6918 4.6278 4.3697 4.0712 4.5085 4.7022 1.3537 2.7632 3.2012 2.2096 3.2982 2.3638 1.3278 2.3268 1.9834 2.2538 5.5112 1.4837 1.7979 8.2228 1.2677 5.9420 2.5413 1.3961 2.3698 5.5537 6.2879 1.3445 5.2458 3.4482 3.3371 2.2543 2.4140 7.4533 2.3031 1.2803 1.4341 1.5215 1.4856 3.5813 1.4340 1.7221 1.5594 1.4828 1.0840 1.5208 1.2696 1.3470 1.4268 1.6119 2.0431 1.5407 1.2625 1.6519 1.1136 1.9404 2.3467 3.8167 2.5849 1.5213 2.6094 1.7243 10.2285 2.3977 1.3595 4.5517 1.5372 1.6411 2.1587 1.2057 1.5427 1.2522 1.1161 1.7271 1.0560 1.0526 1.0887 1.1050 1.0928 1.3262 1.0470 1.0802 1.0945 3.9650 3.6584 9.8959 6.9928 8.0772 6.3049 6.9374 8.3788 1.0640 1.0337 1.0591 1.0571 1.0326 1.0362 1.0689 1.0597 1.0846 1.0987 1.1057 1.1038 1.1029 1.1025 1.1042 1.0993 1.1014 1.0993 1.1004 1.0859 1.0914 1.0903 1.0977 1.0912 1.0960 1.0641 1.0663
irintensity: 0.0092 0.0408 0.5528 0.0679 0.2395 0.2576 0.4196 0.6787 5.7859 1.1457 1.6249 0.5120 1.6188 0.4953 1.5354 1.7996 1.1034 2.9891 3.2511 1.0545 1.8734 3.1146 8.3020 136.5729 0.6675 0.3409 1.5348 1.0901 0.2469 0.5971 1.3764 1.6716 0.1742 3.0207 2.1690 6.1087 2.7276 7.3955 0.7161 9.7114 2.3102 6.4705 6.4648 0.4696 9.9367 10.9332 11.8056 20.2074 44.6203 52.2468 1.6039 18.9461 2.6343 10.2982 3.4490 9.2611 32.7986 23.5655 23.1085 14.4716 9.2137 12.9788 25.3203 13.7538 8.2788 0.8361 42.3188 6.2074 12.5073 3.3242 0.1152 6.6500 54.6354 2.8481 8.3219 8.9253 1.8591 70.4160 137.8736 102.0930 0.2275 6.2516 6.6871 24.0745 8.6680 3.8921 249.8973 27.9003 3.2890 28.1777 33.5689 0.6352 9.6208 35.5807 71.0370 2.7727 1.9405 0.7331 17.2697 32.9357 10.5900 1.0888 93.2631 4.2656 1.7199 1.2080 3.8865 0.2386 1.5150 69.9505 40.0900 17.2263 6.9947 21.9505 9.0652 13.4495 59.2052 33.1709 27.3592 2.9311 94.5290 1.7395 2.1796 71.3873 2.3795 8.5322 41.8648 11.6247 13.9956 13.0137 19.9899 26.5422 10.6501 10.9605 0.1909 16.5259 36.4180 4.2336 28.4681 34.2631 157.7843 18.0633 30.3631 376.0581 14.5974 53.8291 46.9510 78.2280 48.6105 40.7752 21.8840 25.0444 11.0144 4.1066 28.0635 39.6209 4.6084 3.3156 31.3048 50.4707 99.8063 21.9450 20.9500 2.3129 20.1984 8.2345 22.2461 1.4761 9.9260 33.8069 9.3139
temp: 298.150 k
press: 1.00000 atm
elementType: 17 8 8 8 8 8 7 7 6 6 6 6 6 6 6 6 6 6 6 6 6 6 6 6 6 6 6 6 6 6 6 6 1 1 1 1 1 1 1 1 1 1 1 1 1 1 1 1 1 1 1 1 1 1 1 1 1 1 1
symmnumber: 1
zpe: 1220332.3 jmol-1
zpe.correction: 0.464800 hartree
zpe.thermalcorrener: 0.498181 hartree
zpe.thermalcorrenthalpy: 0.499125 hartree
zpe.thermalcorrgfe: 0.393191 hartree
zpe.sumelectzpe: -1874.046111 hartree
zpe.sumelectthermal: -1874.012730 hartree
zpe.sumelectthermalent: -1874.011786 hartree
zpe.sumelectthermalfe: -1874.117721 hartree
dipole: 1.1735 -0.5103 2.4949
dipole: 2.8040
quadrupole: -180.5895 -188.6788 -174.0240
quadrupole: 1.8774 2.7709 4.8929
quadrupole: 0.5080 -7.5814 7.0734 1.8774 2.7709 4.8929
hfenergy: -1874.5109112 hartree
pointgroup: C01 [X(C24H27Cl1N2O5)]
dipole: -0.3821514 -0.6784904 0.7813921 debye
polarizability: 342.3526187|32.701002|298.6801577|15.2808098|25.6558187|274.1239894 unknown
InChI: InChI=1S/C24H27ClN2O5/c1-4-5-10-21-26-18(14-28)23(25)27(21)13-15-11-19(31-2)22(20(12-15)32-3)16-8-6-7-9-17(16)24(29)30/h6-9,11-12,28-29H,4-5,10,13-14H2,1-3H3
charge 0 multiplicity 1
59 atoms
Cl 3.278791 3.036939 3.510465
O  -2.049844 -2.596558 1.728517
O  -1.642876 1.723915 -0.205166
O  4.276386 4.453464 -0.144439
O  -2.133432 -2.713997 -2.971149
O  -0.686962 -1.896476 -1.365653
N  3.023252 0.763935 1.896084
N  4.3018 1.185591 0.072609
C  3.486405 0.282439 0.657715
C  3.084254 -1.052144 0.092294
C  2.05009 0.108807 2.790418
C  3.680161 -1.3183 -1.307432
C  0.679949 -0.05633 2.134916
C  3.594296 2.036803 2.053943
C  4.378426 2.296618 0.934599
C  3.150896 -2.640087 -1.907217
C  0.162963 0.975424 1.324413
C  -0.0408 -1.254545 2.319153
C  -1.798942 -0.429555 0.792047
C  -1.274485 -1.430708 1.646841
C  -1.070037 0.780513 0.657759
C  -3.061244 -0.655635 0.018867
C  5.164756 3.515202 0.592549
C  3.714102 -2.918227 -3.317609
C  -3.103628 -1.406703 -1.197384
C  -4.26717 -0.101451 0.511143
C  -4.341631 -1.58879 -1.873727
C  -5.491593 -0.284139 -0.165752
C  -5.530182 -1.034354 -1.363642
C  -1.866204 -1.989628 -1.788005
C  -1.531058 -3.708539 2.525893
C  -0.893432 2.960604 -0.457284
H  1.978981 -1.110668 0.028088
H  3.39146 -1.864364 0.786541
H  1.978656 0.730095 3.702049
H  2.445289 -0.878345 3.093923
H  4.78539 -1.335425 -1.249236
H  3.423219 -0.47286 -1.973151
H  3.412747 -3.483132 -1.233737
H  2.043041 -2.600709 -1.9442
H  0.742096 1.891853 1.182421
H  0.379438 -2.050428 2.941714
H  6.020813 3.212752 -0.042431
H  5.540456 4.002899 1.515703
H  3.439787 -2.107197 -4.018464
H  3.327217 -3.868737 -3.730342
H  4.818643 -2.982924 -3.299627
H  -4.234399 0.479019 1.43883
H  -4.350352 -2.166013 -2.801515
H  -6.409775 0.156036 0.239188
H  -6.476453 -1.181961 -1.895061
H  4.835251 5.184052 -0.516212
H  -2.286329 -4.502771 2.433689
H  -1.41836 -3.424612 3.590634
H  -0.560953 -4.067924 2.131159
H  -1.510973 3.525577 -1.170515
H  0.096048 2.746918 -0.9034
H  -0.762193 3.54801 0.471674
H  -1.267953 -3.060628 -3.317687
