program: Gaussian 09
title: 000131779
version: EM64L-G09RevD.01
frameworkgroup: C1[X(C12H21N5O3)]
method: RPBEPBE
basis: SDD
operation: Freq
keyword: #p
keyword: freq=noraman
keyword: PBEPBE/SDD
title: #p freq=noraman PBEPBE/SDD
converged: YES YES NO NO
title: Mulliken charges:
elementType: O O O N N N N N C C C C C C C C C C C C H H H H H H H H H H H H H H H H H H H H H
charge: -0.293475 -0.404089 -0.230720 -0.348381 -0.658857 -0.602776 -0.413315 -0.078554 -0.161706 -0.212530 0.005385 -0.092196 -0.765106 -0.732883 -0.610098 0.154764 0.449440 0.169839 -0.480108 -0.240958 0.228068 0.248812 0.222392 0.259999 0.271070 0.171570 0.215300 0.311213 0.211464 0.228660 0.192827 0.262665 0.223370 0.286000 0.296863 0.309987 0.394617 0.315168 0.261735 0.254144 0.380404
chargesum: 0.00000
title: Mulliken charges with hydrogens summed into heavy atoms:
elementType: O O O N N N N N C C C C C C C C C C C C
charge: -0.293475 -0.023686 -0.230720 -0.088382 -0.075994 0.101828 -0.098147 -0.078554 0.066362 0.036281 0.227776 0.178873 -0.067023 -0.099932 -0.124062 0.154764 0.449440 0.169839 -0.218374 0.013186
polarizability: 2.17234507e+02 -7.53569437e+00 1.69553312e+02 -3.49709311e+00 2.09541033e+00 1.29595806e+02
1716.lowfreq: -6.4176 -0.0008 -0.0006 -0.0006 3.1087 7.9520 17.0653 23.4383 34.6379
frequency: 16.7091 23.2524 34.6226 50.1857 54.3373 69.3133 81.6468 86.3755 99.1913 111.8629 146.0165 193.3516 210.8413 233.3705 238.2383 242.4647 262.6392 266.8391 311.4331 314.1721 337.9155 339.7009 366.5948 396.4054 404.8775 432.7092 487.1196 524.3531 566.6075 574.8896 591.4636 605.0662 621.0531 643.7773 653.2209 663.8002 680.8268 696.5337 706.1352 753.5457 772.7319 776.5883 785.5421 825.9926 850.6061 872.3525 894.3569 914.5273 919.9939 953.8395 957.6593 967.1815 984.6973 1000.4754 1017.7235 1034.7589 1041.1236 1091.1981 1103.0421 1107.3989 1109.5602 1130.1029 1144.9674 1163.7702 1170.4571 1175.9675 1189.7004 1227.8653 1234.7418 1240.6245 1247.4319 1273.1412 1285.2305 1306.2772 1318.2772 1326.6250 1331.1983 1342.1198 1348.0306 1366.1694 1368.9595 1372.2793 1378.1942 1400.1039 1435.7766 1460.5526 1467.8903 1474.6039 1486.4452 1487.1244 1502.7105 1568.8918 1569.8709 1620.8337 1636.7701 1662.0265 2958.9741 2961.9974 2962.2031 2963.6298 2971.0022 2998.3814 3010.4969 3046.9731 3054.3964 3068.3872 3070.9060 3088.5851 3090.7595 3222.8354 3239.0409 3407.2674 3422.6959 3512.6283 3526.4625 3576.4991 3579.7273
redmass: 6.1600 6.9048 4.0429 4.1323 6.9831 5.0684 3.3696 4.6741 4.3235 4.6939 5.0519 3.2186 1.2108 3.3737 1.3832 2.8595 3.7854 3.3075 2.8987 2.3063 1.8446 3.2673 2.6471 3.5524 2.0759 3.1138 3.5381 3.9338 2.1149 2.4565 1.5696 1.5282 2.5751 3.1859 2.3519 1.3692 3.0125 2.4687 3.7119 3.6826 2.7184 1.5640 2.2993 1.5956 2.2981 2.4427 5.8852 1.3610 1.7453 1.6380 1.7311 1.2295 3.7539 2.1265 2.1680 3.1039 2.0965 2.0800 2.3402 2.1336 2.0365 2.1776 2.1804 1.5151 1.5002 3.2821 2.0888 1.3251 1.6692 1.7336 1.4862 1.2435 1.3423 1.4302 1.3808 1.6294 1.7105 2.3339 1.5312 1.6525 3.9200 1.3808 1.2299 1.2190 2.9494 1.1161 1.0471 1.0517 1.0543 1.2319 1.0462 4.8240 1.2112 7.4433 1.0894 8.1205 1.0373 1.0682 1.0428 1.0804 1.0819 1.0840 1.0837 1.0962 1.0957 1.0932 1.0975 1.0699 1.0993 1.0979 1.0996 1.0459 1.0729 1.0641 1.0942 1.0822 1.0850
irintensity: 1.1774 1.3584 1.4680 6.0310 3.1372 3.5283 4.0071 1.9092 1.6590 1.3294 5.8706 1.9904 0.9961 3.1592 1.0395 5.3139 1.3834 4.5072 15.3788 2.9621 9.6896 12.8113 1.3485 2.0571 7.2931 3.8763 8.2310 44.2323 19.5246 23.6013 86.5782 137.7009 27.4309 27.0794 68.0974 47.6603 47.9451 33.4775 14.3177 1.2132 37.6075 17.2896 7.6981 27.5748 144.5853 28.6762 12.2563 10.1376 20.7166 17.3425 15.3607 111.6171 15.2732 6.4425 27.6165 238.8387 9.9558 33.8640 15.4177 30.8249 6.3364 5.2374 15.2606 5.1111 4.0566 52.0100 2.4507 2.5825 7.3038 15.0006 5.0041 1.4424 1.8531 1.9168 7.4212 33.3175 26.7383 12.3783 10.6440 10.3764 14.7667 17.3079 11.6156 27.9124 20.9740 6.5270 4.0451 6.4563 9.0663 55.6959 19.1542 8.7012 183.2314 297.2391 31.8120 247.0921 29.7376 40.7624 69.7589 25.5109 15.6371 18.1091 3.1344 19.9091 61.6356 5.1741 56.1419 468.1374 3.5545 5.8711 1.5639 0.1560 0.5828 31.9508 2.5674 35.2188 37.3086
temp: 298.150 k
press: 1.00000 atm
elementType: 8 8 8 7 7 7 7 7 6 6 6 6 6 6 6 6 6 6 6 6 1 1 1 1 1 1 1 1 1 1 1 1 1 1 1 1 1 1 1 1 1
symmnumber: 1
zpe: 888373.1 jmol-1
zpe.correction: 0.338363 hartree
zpe.thermalcorrener: 0.359766 hartree
zpe.thermalcorrenthalpy: 0.360710 hartree
zpe.thermalcorrgfe: 0.285681 hartree
zpe.sumelectzpe: -967.762836 hartree
zpe.sumelectthermal: -967.741434 hartree
zpe.sumelectthermalent: -967.740490 hartree
zpe.sumelectthermalfe: -967.815518 hartree
dipole: 6.5379 1.8991 0.4392
dipole: 6.8223
quadrupole: -125.4792 -122.7949 -114.4260
quadrupole: -7.0559 -0.7032 3.6844
quadrupole: -4.5792 -1.8949 6.4740 -7.0559 -0.7032 3.6844
hfenergy: -968.1011996 hartree
pointgroup: C01 [X(C12H21N5O3)]
dipole: -2.5184118 -0.9030635 0.2154727 debye
polarizability: 218.0829763|-4.7883107|168.907671|1.009982|-0.5564796|129.3929784 unknown
InChI: InChI=1S/C12H21N5O3/c1-6(2)9(13)10(11(14)18)17-8(12(19)20)3-7-4-15-5-16-7/h4-6,8-10,16-17,19H,3,13-14H2,1-2H3
charge 0 multiplicity 1
41 atoms
O  -0.492263 -2.713988 -0.594548
O  1.836127 0.170466 2.072581
O  0.121688 1.692955 1.727204
N  -0.69756 0.05617 -0.555784
N  -4.120195 -0.865041 0.792094
N  -2.45839 -3.023378 0.634226
N  3.793839 -0.635986 -0.582906
N  5.322543 0.999072 -0.273299
C  -3.177985 -0.299659 -0.232562
C  -1.716893 -0.699398 0.19206
C  -3.367612 1.228909 -0.493283
C  0.677262 -0.012337 -0.018233
C  -3.153132 2.091295 0.77154
C  -4.753417 1.496668 -1.128709
C  1.636677 0.647342 -1.068506
C  -1.496813 -2.249842 0.038667
C  3.097823 0.573865 -0.740273
C  0.796845 0.72491 1.315097
C  4.065744 1.565505 -0.549403
C  5.121032 -0.33277 -0.296656
H  -3.411219 -0.827655 -1.181671
H  -1.610374 -0.440443 1.264493
H  -2.582736 1.516014 -1.218928
H  -0.680304 -0.254654 -1.538537
H  1.008837 -1.058119 0.152834
H  -3.883787 1.846131 1.569554
H  -3.300153 3.159584 0.527331
H  -2.129286 1.982618 1.167383
H  -4.909619 0.893173 -2.044055
H  -4.849396 2.561428 -1.408372
H  -5.578306 1.271366 -0.423535
H  1.342676 1.703575 -1.195198
H  1.432819 0.135915 -2.033044
H  -4.08014 -0.328296 1.670761
H  -5.088774 -0.88901 0.447407
H  -2.389725 -4.039888 0.569357
H  -3.314636 -2.510252 0.953148
H  3.37767 -1.566596 -0.618234
H  3.934757 2.644779 -0.595274
H  5.881211 -1.089865 -0.119584
H  1.979266 0.717136 2.892559
